{"text_format":"1","workbook":"xlsx","n_sheets":6,"sheets":["Page 1","Page 2","Page 3","Page 4","Scoring Form","Plants table"],"not_rendered":{"charts":0,"images":0,"macros":1,"external_links":0,"defined_names":0,"comments":0,"pivot_tables":0},"unopened":[],"bounds":{"document_bytes":16777216,"sheet_cells":100000,"rows_first":2000,"rows_last":500,"rows_between":2000,"halvings":0,"cell_chars":16384,"cell_head_chars":4096},"cells_cut":0,"cells_raw":0,"read":"whole","date_system":"1900"}

{"sheet":"Page 1","index":0,"n_rows":65,"n_cols":10,"rows_kept":65,"cut":false,"hidden":false,"merged":[[62,1,62,2],[62,3,62,6],[64,1,64,9],[57,2,57,4],[57,6,57,7],[58,0,60,0],[58,2,58,4],[58,6,58,7],[59,2,59,4],[59,6,59,7],[60,2,60,4],[60,6,60,7],[49,0,55,0],[49,2,49,4],[49,6,49,9],[50,2,50,4],[50,6,50,9],[51,2,51,4],[52,2,52,4],[52,6,52,9],[53,2,53,4],[53,6,53,9],[54,2,54,4],[39,0,39,2],[46,0,46,2],[46,7,46,8],[48,2,48,4],[48,6,48,9],[34,2,34,4],[34,6,34,9],[35,7,35,9],[37,0,37,2],[38,0,38,2],[31,2,31,4],[31,6,31,9],[32,2,32,4],[32,6,32,9],[33,2,33,4],[33,6,33,9],[29,0,29,1],[29,2,29,3],[29,4,29,8],[30,2,30,4],[30,6,30,9],[26,0,26,1],[27,0,27,1],[28,0,28,1],[28,2,28,3],[28,4,28,8],[11,0,11,9],[12,0,17,9],[20,0,20,9],[22,0,24,9],[25,0,25,1],[25,2,25,8],[6,1,6,4],[6,8,6,9],[7,0,7,1],[7,2,7,3],[7,5,7,9],[0,0,0,9],[2,1,2,9],[4,0,4,1],[4,2,4,3],[4,4,4,5],[4,6,4,8]]}
["MARYLAND WETLAND ECOLOGICAL INTEGRITY ASSESSMENT: Piedmont Region"]
[]
["How to use this form:","Cells with a yellow or orange background are intended to accept user input, and cells with a green background will automatically fill or calculate based on input to other cells. Green cells do not need to be edited by the user. Orange cells are only intended to accept a small list of acceptable input terms, and will show a drop-down box to choose one of these options if the cell is selected.\n\nACOE Delineation Excel Workbooks may be found at this page under \"General Information\": https://www.usace.army.mil/Missions/Civil-Works/Regulatory-Program-and-Permits/reg_supp/\n\nPlease ensure that the linked ACOE workbook does not have any special characters (Such as parentheses) in its filename, as this will cause the \"Import Data\" function to not work. This workbook will only read plants from the 4-strata plants page of the ACOE Wetland Delineation. Data from the linked ACOE Wetland Delineation is only copied over once each time the \"Import Data\" button is clicked, and will not automatically refresh. If you make changes on the ACOE Wetland Delineation, you will need to click \"Import Data\" again to copy any changes into this document.\n\nMake sure that Macros aren't disabled on this document before running \"Import Data\", this can be found by going to your file browser, right-clicking on this document, and selecting \"Unblock\" from the \"Security\" section near the bottom of the Properties dialog. Additionally, under File>Options>Advanced, check the box under Link Handling to open supported hyperlinks to Office files.\n\nWhen saving, please select the filetype \"Excel Macro-enabled workbook (*.xlsm)\"."]
[]
["Associated ACOE Wetland Delineation"]
[]
["Project/Site Name:",{"$f":"INDIRECT(\"'Page 1 (Hydrology)'!$G$2\")","v":{"$error":"#REF!"}},null,null,null,"City/County:",{"$f":"INDIRECT(\"'Page 1 (Hydrology)'!$AC$2\")","v":{"$error":"#REF!"}},"Sampling Date:",{"$f":"INDIRECT(\"'Page 1 (Hydrology)'!$AP$2\")","v":{"$error":"#REF!"}}]
["Assessment Area Name (if >1 AA):",null,{"$f":"INDIRECT(\"'Page 1 (Hydrology)'!$AP$3\")","v":{"$error":"#REF!"}},null,"Observer(s):",{"$f":"INDIRECT(\"'Page 1 (Hydrology)'!$H$4\")","v":{"$error":"#REF!"}}]
["Delineation performed:",null,"Latitude:",{"$f":"INDIRECT(\"'Page 1 (Hydrology)'!$R$6\")","v":{"$error":"#REF!"}},"Longitude:",{"$f":"INDIRECT(\"'Page 1 (Hydrology)'!$AE$6\")","v":{"$error":"#REF!"}},"AA size:",null,"units"]
[]
[]
["Site Description: (general landscape setting, overview of riparian corridor, presence of braided/multithread system, topography including karst, vegetation patterns, complexity and habitat richness; human and natural disturbance as indicated by spoil piles, beaver activity, dumping, vegetation removal, pest impacts, excessive flow; description of adjacent stream and sources/evidence of water input or alterations such as culverts, roads/trails, sediment). Representative site photographs of soil, nearest stream channel and banks, and vegetation are useful to show the features present. "]
[]
[]
[]
{"$rows_left_out":51}
{"sheet":"Page 2","index":1,"n_rows":81,"n_cols":13,"rows_kept":81,"cut":false,"hidden":false,"merged":[[15,8,15,9],[64,4,64,5],[76,0,76,1],[69,8,69,9],[15,10,15,11],[69,3,69,5],[71,0,71,1],[72,8,72,9],[74,0,74,1],[74,2,74,3],[63,0,63,1],[66,0,66,1],[66,2,66,3],[68,0,68,1],[49,2,49,4],[53,2,54,10],[56,0,56,12],[58,0,58,1],[61,4,61,5],[40,8,40,9],[42,10,42,11],[44,0,44,1],[44,2,44,3],[46,2,46,3],[27,0,27,1],[29,10,29,11],[32,2,32,4],[33,2,33,4],[34,1,34,4],[34,10,34,11],[25,0,25,1],[25,2,25,6],[25,10,25,11],[23,0,23,1],[23,2,23,6],[23,10,23,11],[16,1,16,10],[17,0,17,1],[17,2,17,10],[21,0,21,1],[21,4,21,5],[21,8,21,9],[21,10,21,11],[8,1,8,3],[8,4,8,10],[9,2,9,5],[12,0,12,12],[14,2,14,4],[0,0,0,12],[1,0,1,12],[3,2,3,5],[3,8,3,9],[7,2,7,5],[7,8,7,10]]}
["MARYLAND WETLAND ECOLOGICAL INTEGRITY ASSESSMENT: Piedmont Region"]
["Page 2: KWH Classification, Soil, Hydrology part 1"]
[]
[null,"Project/Site Name:",{"$f":"IF(ISBLANK('Page 1'!B7),\"\",'Page 1'!B7)","v":{"$error":"#REF!"}},null,null,null,null,null,null,null,null,"Sampling Date:",{"$f":"IF(ISBLANK('Page 1'!I7),\"\",'Page 1'!I7)","v":{"$error":"#REF!"}}]
[]
[]
["CLASSIFICATION OF AA TO KEY WILDLIFE HABITAT AND HGM CLASS (Section 4.3)"]
[null,"Key Wildlife Habitat:",null,null,null,null,null,"HGM Class:"]
[null,"Optional: NVC Community Type/Plant Association:"]
[null,"Stream Key Wildlife Habitat:"]
[]
[]
["SOIL/SUBSTRATE (Section 4.4)"]
["Note: if the floodplain does not naturally have hydric soils and/or does not have functioning hydric soils under current conditions, only score Microtopography and Organic Matter Accumulation, and Soil Disturbance."]
[null,"Mapped soil type:",{"$f":"INDIRECT(\"'Page 1 (Hydrology)'!I7\")","v":{"$error":"#REF!"}},null,null,"Depth to water table:",{"$f":"INDIRECT(\"'Page 1 (Hydrology)'!W39\")","v":{"$error":"#REF!"}},"Hydric soil?",{"$f":"IF(OR(INDIRECT(\"'Page 1 (Hydrology)'!Q13\")=\"X\",INDIRECT(\"'Page 3 (Soil)'!BE31\")=\"X\"),\"Y\",\"N\")","v":{"$error":"#REF!"}},"Hydric soil indicators:",{"$f":"CONCATENATE(IF(INDIRECT(\"'Page 3 (Soil)'!W15\")=\"X\",INDIRECT(\"'Page 3 (Soil)'!X15\"),\"\"), \",\",\nIF(INDIRECT(\"'Page 3 (Soil)'!W16\")=\"X\",INDIRECT(\"'Page 3 (Soil)'!X16\"),\"\"), \",\",\nIF(INDIRECT(\"'Page 3 (Soil)'!W17\")=\"X\",INDIRECT(\"'Page 3 (Soil)'!X17\"),\"\"), \",\",\nIF(INDIRECT(\"'Page 3 (Soil)'!W18\")=\"X\",INDIRECT(\"'Page 3 (Soil)'!X18\"),\"\"), \",\",\nIF(INDIRECT(\"'Page 3 (Soil)'!W19\")=\"X\",INDIRECT(\"'Page 3 (Soil)'!X19\"),\"\"), \",\",\nIF(INDIRECT(\"'Page 3 (Soil)'!W20\")=\"X\",INDIRECT(\"'Page 3 (Soil)'!X20\"),\"\"), \",\",\nIF(INDIRECT(\"'Page 3 (Soil)'!W21\")=\"X\",INDIRECT(\"'Page 3 (Soil)'!X21\"),\"\"), \",\",\nIF(INDIRECT(\"'Page 3 (Soil)'!W22\")=\"X\",INDIRECT(\"'Page 3 (Soil)'!X22\"),\"\"), \",\",\nIF(INDIRECT(\"'Page 3 (Soil)'!W23\")=\"X\",INDIRECT(\"'Page 3 (Soil)'!X23\"),\"\"), \",\",\nIF(INDIRECT(\"'Page 3 (Soil)'!W25\")=\"X\",INDIRECT(\"'Page 3 (Soil)'!X25\"),\"\"), \",\",\nIF(INDIRECT(\"'Page 3 (Soil)'!W26\")=\"X\",INDIRECT(\"'Page 3 (Soil)'!X26\"),\"\"), \",\",\nIF(INDIRECT(\"'Page 3 (Soil)'!W27\")=\"X\",INDIRECT(\"'Page 3 (Soil)'!X27\"),\"\"), \",\",\nIF(INDIRECT(\"'Page 3 (Soil)'!AW15\")=\"X\",INDIRECT(\"'Page 3 (Soil)'!AX15\"),\"\"), \",\",\nIF(INDIRECT(\"'Page 3 (Soil)'!AW16\")=\"X\",INDIRECT(\"'Page 3 (Soil)'!AX16\"),\"\"), \",\",\nIF(INDIRECT(\"'Page 3 (Soil)'!AW18\")=\"X\",INDIRECT(\"'Page 3 (Soil)'!AX18\"),\"\"), \",\",\nIF(INDIRECT(\"'Page 3 (Soil)'!AW20\")=\"X\",INDIRECT(\"'Page 3 (Soil)'!AX20\"),\"\"), \",\",\nIF(INDIRECT(\"'Page 3 (Soil)'!AW22\")=\"X\",INDIRECT(\"'Page 3 (Soil)'!AX22\"),\"\"), \",\",\nIF(INDIRECT(\"'Page 3 (Soil)'!AW23\")=\"X\",INDIRECT(\"'Page 3 (Soil)'!AX23\"),\"\"))","v":{"$error":"#REF!"}}]
{"$rows_left_out":67}
{"sheet":"Page 3","index":2,"n_rows":62,"n_cols":13,"rows_kept":62,"cut":false,"hidden":false,"merged":[[59,3,59,4],[61,2,62,10],[53,0,53,12],[54,5,54,6],[55,5,55,6],[56,5,56,11],[58,3,58,4],[47,4,47,5],[47,6,47,7],[47,8,47,9],[48,4,48,5],[50,2,51,10],[42,4,42,5],[43,4,43,5],[44,4,44,5],[45,4,45,5],[45,8,45,10],[34,5,34,10],[35,2,35,3],[37,2,37,10],[39,0,39,12],[40,4,40,5],[21,1,21,3],[21,4,21,10],[24,2,24,10],[28,0,28,12],[29,0,29,4],[18,0,18,1],[18,2,18,5],[19,0,19,1],[19,2,19,5],[20,0,20,1],[20,2,20,3],[14,0,14,1],[14,2,14,3],[15,0,15,1],[17,0,17,1],[17,2,17,3],[8,0,8,1],[8,4,8,5],[9,4,9,5],[11,2,11,10],[13,0,13,12],[0,0,0,12],[1,0,1,12],[3,2,3,5],[3,8,3,9],[7,0,7,1]]}
["MARYLAND WETLAND ECOLOGICAL INTEGRITY ASSESSMENT: Piedmont Region"]
["Page 3: Hydrology part 2, Key Wildlife Habitat part 1"]
[]
[null,"Project/Site Name:",{"$f":"IF(ISBLANK('Page 1'!B7),\"\",'Page 1'!B7)","v":{"$error":"#REF!"}},null,null,null,null,null,null,null,null,"Sampling Date:",{"$f":"IF(ISBLANK('Page 1'!I7),\"\",'Page 1'!I7)","v":{"$error":"#REF!"}}]
[]
[]
["HYDROLOGY (Section 4.5)"]
["Aquatic life:",null,"(if available for site or use nearest, most recent Biological Stream Survey point in stream): "]
["Benthic IBI- Value: ",null,null,"Rating:",{"$f":"IF(C9=\"\",\"\",IF(C9>=4,\"Good\",IF(C9>=3,\"Fair\",IF(C9>=0,\"Poor\",\"Invalid value\"))))","v":""}]
[null,"Fish IBI- Value: ",null,"Rating:",{"$f":"IF(C10=\"\",\"\",IF(C10>=4,\"Good\",IF(C10>=3,\"Fair\",IF(C10>=0,\"Poor\",\"Invalid value\"))))","v":""}]
[]
[null,"Observations/comments:"]
[]
["Hydroperiod and Hydrologic Connectivity  Determine the natural variability and/or recent alteration of the duration, frequency, and magnitude of inundation/saturation in the AA by KWH type."]
["Natural variation of hydroperiod:"]
{"$rows_left_out":48}
{"sheet":"Page 4","index":3,"n_rows":81,"n_cols":20,"rows_kept":81,"cut":false,"hidden":false,"merged":[[63,2,64,13],[66,0,66,15],[69,7,69,14],[71,0,72,1],[71,2,72,13],[74,2,75,13],[77,0,77,15],[78,0,78,1],[79,0,79,1],[54,2,55,13],[57,0,57,15],[58,0,58,2],[58,3,58,10],[59,0,59,2],[59,3,59,10],[60,0,60,2],[60,3,60,10],[61,0,61,2],[61,3,61,10],[43,1,43,4],[43,11,43,14],[44,1,44,4],[44,11,44,14],[46,0,46,17],[50,0,50,15],[51,0,51,3],[51,4,51,10],[52,0,52,3],[52,4,52,10],[38,1,38,4],[38,11,38,14],[39,0,39,17],[40,1,40,4],[40,11,40,14],[41,1,41,4],[41,11,41,14],[42,1,42,4],[42,11,42,14],[33,1,33,4],[33,11,33,14],[34,1,34,4],[34,11,34,14],[35,1,35,4],[35,11,35,14],[36,1,36,4],[36,11,36,14],[37,1,37,4],[37,11,37,14],[28,1,28,4],[28,11,28,14],[29,1,29,4],[29,11,29,14],[30,1,30,4],[30,11,30,14],[31,1,31,4],[31,11,31,14],[32,1,32,4],[32,11,32,14],[23,1,23,4],[23,11,23,14],[24,1,24,4],[24,11,24,14],[25,1,25,4],[25,11,25,14],[26,1,26,4],[26,11,26,14],[27,0,27,17],[18,1,18,4],[18,11,18,14],[19,1,19,4],[19,11,19,14],[20,1,20,4],[20,11,20,14],[21,1,21,4],[21,11,21,14],[22,1,22,4],[22,11,22,14],[13,1,13,4],[13,11,13,14],[14,1,14,4],[14,11,14,14],[15,1,15,4],[15,11,15,14],[16,1,16,4],[16,11,16,14],[17,0,17,17],[9,0,9,17],[10,1,10,4],[10,11,10,14],[11,1,11,4],[11,11,11,14],[12,1,12,4],[12,11,12,14],[7,0,8,4],[7,5,8,5],[7,6,8,6],[7,7,8,7],[7,8,8,8],[7,9,8,9],[7,10,8,14],[7,15,8,15],[7,16,8,16],[0,0,0,15],[1,0,1,15],[3,2,3,5],[3,11,3,12],[3,14,3,15],[6,0,6,15],[7,17,8,17],[7,18,8,18],[7,19,8,19]]}
["MARYLAND WETLAND ECOLOGICAL INTEGRITY ASSESSMENT: Piedmont Region"]
["Page 3: KWH pt 2"]
[]
[null,"Project/Site Name:",{"$f":"IF(ISBLANK('Page 1'!B7),\"\",'Page 1'!B7)","v":{"$error":"#REF!"}},null,null,null,null,null,null,null,null,null,null,"Sampling Date:",{"$f":"IF(ISBLANK('Page 1'!I7),\"\",'Page 1'!I7)","v":{"$error":"#REF!"}}]
[]
[]
["VEGETATION (Section 4.6) Additional species may be listed on a separate sheet. See Scoring Sheet for %cover examples.\nNOTE: Include native diagnostic, disturbance indicator, and state rare, threatened, and endangered species regardless of %cover."]
["Species:",null,null,null,null,"Absolute % Cover:","WPL Rating","C-Value If Native","Unique native","Unique total","Species:",null,null,null,null,"Absolute % Cover:","WPL Rating","C-Value If Native","Unique native","Unique total"]
[]
["Tree Stratum: woody plants, excluding woody vines, approximately 20 ft (6 m) or more in height and 3 in. (7.6 cm) or larger DBH"]
[1,{"$f":"INDIRECT(\"'Page 2 (Vegetation, 4 Strata)'!$D4\")","v":{"$error":"#REF!"}},null,null,null,{"$f":"INDIRECT(\"'Page 2 (Vegetation, 4 Strata)'!$Z4\")","v":{"$error":"#REF!"}},{"$f":"IFERROR(IF(ISBLANK(B11),\"\",VLOOKUP(B11,'Plants table'!$A:$G,6, 0)),\"\")","v":""},{"$f":"IFERROR(IF(ISBLANK(B11),\"\",IF(VLOOKUP(B11,'Plants table'!$A:$G,3, 0) = \"native\", VLOOKUP(B11,'Plants table'!$A:$G,4, 0),\"non-native\")),\"\")","v":""},{"$f":"IF(COUNTIF(B$11:B11,B11)>1,0,IF(H11 = \"\",0,IF(H11=\"non-native\",0,1)))","v":0},{"$f":"IF(COUNTIF(B$11:B11,B11)>1,0,IF(H11 = \"\",0,1))","v":0},8,{"$f":"INDIRECT(\"'Vegetation Continued, 4 Strata'!$D4\")","v":{"$error":"#REF!"}},null,null,null,{"$f":"INDIRECT(\"'Vegetation Continued, 4 Strata'!$Z4\")","v":{"$error":"#REF!"}},{"$f":"IFERROR(IF(ISBLANK(L11),\"\",VLOOKUP(L11,'Plants table'!$A:$G,6, 0)),\"\")","v":""},{"$f":"IFERROR(IF(ISBLANK(L11),\"\",IF(VLOOKUP(L11,'Plants table'!$A:$G,3, 0) = \"native\", VLOOKUP(L11,'Plants table'!$A:$G,4, 0),\"non-native\")),\"\")","v":""},{"$f":"IF(COUNTIF(L$11:L11,L11)>1,0,IF(COUNTIF($B$11:$B$45,L11)>0,0,(IF(R11 = \"\",0,IF(R11=\"non-native\",0,1)))))","v":0},{"$f":"IF(COUNTIF(L$11:L11,L11)>1,0,IF(COUNTIF($B$11:$B$45,L11)>0,0,IF(R11 = \"\",0,1)))","v":0}]
[2,{"$f":"INDIRECT(\"'Page 2 (Vegetation, 4 Strata)'!$D5\")","v":{"$error":"#REF!"}},null,null,null,{"$f":"INDIRECT(\"'Page 2 (Vegetation, 4 Strata)'!$Z5\")","v":{"$error":"#REF!"}},{"$f":"IFERROR(IF(ISBLANK(B12),\"\",VLOOKUP(B12,'Plants table'!$A:$G,6, 0)),\"\")","v":""},{"$f":"IFERROR(IF(ISBLANK(B12),\"\",IF(VLOOKUP(B12,'Plants table'!$A:$G,3, 0) = \"native\", VLOOKUP(B12,'Plants table'!$A:$G,4, 0),\"non-native\")),\"\")","v":""},{"$f":"IF(COUNTIF(B$11:B12,B12)>1,0,IF(H12 = \"\",0,IF(H12=\"non-native\",0,1)))","v":0},{"$f":"IF(COUNTIF(B$11:B12,B12)>1,0,IF(H12 = \"\",0,1))","v":0},9,{"$f":"INDIRECT(\"'Vegetation Continued, 4 Strata'!$D5\")","v":{"$error":"#REF!"}},null,null,null,{"$f":"INDIRECT(\"'Vegetation Continued, 4 Strata'!$Z5\")","v":{"$error":"#REF!"}},{"$f":"IFERROR(IF(ISBLANK(L12),\"\",VLOOKUP(L12,'Plants table'!$A:$G,6, 0)),\"\")","v":""},{"$f":"IFERROR(IF(ISBLANK(L12),\"\",IF(VLOOKUP(L12,'Plants table'!$A:$G,3, 0) = \"native\", VLOOKUP(L12,'Plants table'!$A:$G,4, 0),\"non-native\")),\"\")","v":""},{"$f":"IF(COUNTIF(L$11:L12,L12)>1,0,IF(COUNTIF($B$11:$B$45,L12)>0,0,(IF(R12 = \"\",0,IF(R12=\"non-native\",0,1)))))","v":0},{"$f":"IF(COUNTIF(L$11:L12,L12)>1,0,IF(COUNTIF($B$11:$B$45,L12)>0,0,IF(R12 = \"\",0,1)))","v":0}]
[3,{"$f":"INDIRECT(\"'Page 2 (Vegetation, 4 Strata)'!$D6\")","v":{"$error":"#REF!"}},null,null,null,{"$f":"INDIRECT(\"'Page 2 (Vegetation, 4 Strata)'!$Z6\")","v":{"$error":"#REF!"}},{"$f":"IFERROR(IF(ISBLANK(B13),\"\",VLOOKUP(B13,'Plants table'!$A:$G,6, 0)),\"\")","v":""},{"$f":"IFERROR(IF(ISBLANK(B13),\"\",IF(VLOOKUP(B13,'Plants table'!$A:$G,3, 0) = \"native\", VLOOKUP(B13,'Plants table'!$A:$G,4, 0),\"non-native\")),\"\")","v":""},{"$f":"IF(COUNTIF(B$11:B13,B13)>1,0,IF(H13 = \"\",0,IF(H13=\"non-native\",0,1)))","v":0},{"$f":"IF(COUNTIF(B$11:B13,B13)>1,0,IF(H13 = \"\",0,1))","v":0},10,{"$f":"INDIRECT(\"'Vegetation Continued, 4 Strata'!$D6\")","v":{"$error":"#REF!"}},null,null,null,{"$f":"INDIRECT(\"'Vegetation Continued, 4 Strata'!$Z6\")","v":{"$error":"#REF!"}},{"$f":"IFERROR(IF(ISBLANK(L13),\"\",VLOOKUP(L13,'Plants table'!$A:$G,6, 0)),\"\")","v":""},{"$f":"IFERROR(IF(ISBLANK(L13),\"\",IF(VLOOKUP(L13,'Plants table'!$A:$G,3, 0) = \"native\", VLOOKUP(L13,'Plants table'!$A:$G,4, 0),\"non-native\")),\"\")","v":""},{"$f":"IF(COUNTIF(L$11:L13,L13)>1,0,IF(COUNTIF($B$11:$B$45,L13)>0,0,(IF(R13 = \"\",0,IF(R13=\"non-native\",0,1)))))","v":0},{"$f":"IF(COUNTIF(L$11:L13,L13)>1,0,IF(COUNTIF($B$11:$B$45,L13)>0,0,IF(R13 = \"\",0,1)))","v":0}]
[4,{"$f":"INDIRECT(\"'Page 2 (Vegetation, 4 Strata)'!$D7\")","v":{"$error":"#REF!"}},null,null,null,{"$f":"INDIRECT(\"'Page 2 (Vegetation, 4 Strata)'!$Z7\")","v":{"$error":"#REF!"}},{"$f":"IFERROR(IF(ISBLANK(B14),\"\",VLOOKUP(B14,'Plants table'!$A:$G,6, 0)),\"\")","v":""},{"$f":"IFERROR(IF(ISBLANK(B14),\"\",IF(VLOOKUP(B14,'Plants table'!$A:$G,3, 0) = \"native\", VLOOKUP(B14,'Plants table'!$A:$G,4, 0),\"non-native\")),\"\")","v":""},{"$f":"IF(COUNTIF(B$11:B14,B14)>1,0,IF(H14 = \"\",0,IF(H14=\"non-native\",0,1)))","v":0},{"$f":"IF(COUNTIF(B$11:B14,B14)>1,0,IF(H14 = \"\",0,1))","v":0},11,{"$f":"INDIRECT(\"'Vegetation Continued, 4 Strata'!$D7\")","v":{"$error":"#REF!"}},null,null,null,{"$f":"INDIRECT(\"'Vegetation Continued, 4 Strata'!$Z7\")","v":{"$error":"#REF!"}},{"$f":"IFERROR(IF(ISBLANK(L14),\"\",VLOOKUP(L14,'Plants table'!$A:$G,6, 0)),\"\")","v":""},{"$f":"IFERROR(IF(ISBLANK(L14),\"\",IF(VLOOKUP(L14,'Plants table'!$A:$G,3, 0) = \"native\", VLOOKUP(L14,'Plants table'!$A:$G,4, 0),\"non-native\")),\"\")","v":""},{"$f":"IF(COUNTIF(L$11:L14,L14)>1,0,IF(COUNTIF($B$11:$B$45,L14)>0,0,(IF(R14 = \"\",0,IF(R14=\"non-native\",0,1)))))","v":0},{"$f":"IF(COUNTIF(L$11:L14,L14)>1,0,IF(COUNTIF($B$11:$B$45,L14)>0,0,IF(R14 = \"\",0,1)))","v":0}]
[5,{"$f":"INDIRECT(\"'Page 2 (Vegetation, 4 Strata)'!$D8\")","v":{"$error":"#REF!"}},null,null,null,{"$f":"INDIRECT(\"'Page 2 (Vegetation, 4 Strata)'!$Z8\")","v":{"$error":"#REF!"}},{"$f":"IFERROR(IF(ISBLANK(B15),\"\",VLOOKUP(B15,'Plants table'!$A:$G,6, 0)),\"\")","v":""},{"$f":"IFERROR(IF(ISBLANK(B15),\"\",IF(VLOOKUP(B15,'Plants table'!$A:$G,3, 0) = \"native\", VLOOKUP(B15,'Plants table'!$A:$G,4, 0),\"non-native\")),\"\")","v":""},{"$f":"IF(COUNTIF(B$11:B15,B15)>1,0,IF(H15 = \"\",0,IF(H15=\"non-native\",0,1)))","v":0},{"$f":"IF(COUNTIF(B$11:B15,B15)>1,0,IF(H15 = \"\",0,1))","v":0},12,{"$f":"INDIRECT(\"'Vegetation Continued, 4 Strata'!$D8\")","v":{"$error":"#REF!"}},null,null,null,{"$f":"INDIRECT(\"'Vegetation Continued, 4 Strata'!$Z8\")","v":{"$error":"#REF!"}},{"$f":"IFERROR(IF(ISBLANK(L15),\"\",VLOOKUP(L15,'Plants table'!$A:$G,6, 0)),\"\")","v":""},{"$f":"IFERROR(IF(ISBLANK(L15),\"\",IF(VLOOKUP(L15,'Plants table'!$A:$G,3, 0) = \"native\", VLOOKUP(L15,'Plants table'!$A:$G,4, 0),\"non-native\")),\"\")","v":""},{"$f":"IF(COUNTIF(L$11:L15,L15)>1,0,IF(COUNTIF($B$11:$B$45,L15)>0,0,(IF(R15 = \"\",0,IF(R15=\"non-native\",0,1)))))","v":0},{"$f":"IF(COUNTIF(L$11:L15,L15)>1,0,IF(COUNTIF($B$11:$B$45,L15)>0,0,IF(R15 = \"\",0,1)))","v":0}]
{"$rows_left_out":67}
{"sheet":"Scoring Form","index":4,"n_rows":49,"n_cols":9,"rows_kept":49,"cut":false,"hidden":false,"merged":[[46,0,47,7],[44,1,44,6],[45,1,45,6],[25,0,25,7],[26,0,26,6],[31,1,31,6],[32,1,32,6],[33,0,33,6],[34,1,34,6],[35,0,35,6],[36,1,36,6],[38,0,38,6],[39,1,40,6],[41,1,42,6],[43,1,43,6],[16,0,18,1],[16,2,16,3],[26,8,45,8],[27,0,27,6],[28,1,28,6],[29,1,29,6],[30,1,30,6],[37,1,37,6],[19,8,24,8],[20,2,20,3],[21,2,21,3],[22,2,22,3],[23,2,23,3],[24,2,24,3],[19,0,24,1],[19,2,19,3],[10,2,10,3],[11,8,15,8],[19,5,24,5],[19,6,24,6],[19,7,24,7],[16,5,18,5],[16,6,18,6],[16,7,18,7],[7,7,10,7],[16,8,18,8],[17,2,17,3],[18,2,18,3],[7,8,10,8],[8,2,8,3],[9,2,9,3],[11,0,15,1],[11,2,11,3],[11,5,15,5],[11,6,15,6],[11,7,15,7],[13,2,13,3],[12,2,12,3],[14,2,14,3],[15,2,15,3],[48,0,48,1],[48,2,48,8],[0,0,0,8],[1,0,1,8],[2,0,2,1],[2,2,2,5],[3,0,3,2],[3,3,3,4],[3,6,3,8],[6,0,6,1],[6,2,6,3],[6,5,6,6],[7,0,10,1],[7,2,7,3],[7,5,10,5],[7,6,10,6]]}
["MARYLAND WETLAND ECOLOGICAL INTEGRITY ASSESSMENT: Piedmont Region"]
["SCORING FORM"]
["Project/Site Name:",null,{"$f":"IF(ISBLANK('Page 1'!B7),\"\",'Page 1'!B7)","v":{"$error":"#REF!"}},null,null,null,"City/County:",{"$f":"IF(ISBLANK('Page 1'!G7),\"\",'Page 1'!G7)","v":{"$error":"#REF!"}},{"$f":"IF(ISBLANK('Page 1'!I7),\"\",'Page 1'!I7)","v":{"$error":"#REF!"}}]
["Assessment Area Name (if >1 AA):",null,null,{"$f":"IF(ISBLANK('Page 1'!C8),\"\",'Page 1'!C8)","v":{"$error":"#REF!"}},null,"Observer(s):",{"$f":"IF(ISBLANK('Page 1'!F8),\"\",'Page 1'!F8)","v":{"$error":"#REF!"}}]
[]
[]
["Core Factor",null,"Metric",null,"Metric Score","Mean Core Factor Score",null,"Weighing Factor","Overall Core Factor Score"]
["Landscape (Assessment for project area)",null,"Buffer Perimeter",null,{"$f":"'Page 1'!J27","v":""},"\n(Sum of metric scores: ) / 4 = ",{"$f":"IF(SUM(E8:E11)>3, SUM(E8:E11)/4, \"\")","v":""},0.3,{"$f":"IF(G8=\"\",\"\",G8*H8)","v":""}]
[null,null,"Buffer Condition",null,{"$f":"'Page 1'!J28","v":""}]
[null,null,"Aquatic Context",null,{"$f":"'Page 1'!J29","v":""}]
[null,null,"Comparative Size",null,{"$f":"'Page 1'!J30","v":""}]
["\nSoil/Substrate",null,"Redox Concentrations",null,{"$f":"'Page 2'!M22","v":{"$error":"#REF!"}},"\n(Sum of metric scores: ) / 5 or / 3* =   ",{"$f":"IF(AND(E12=\"\",E14=\"\",E13=\"\",E15=\"\",E16=\"\"),\"\",AVERAGE(E12:E16))","v":{"$error":"#REF!"}},0.1,{"$f":"IF(G12=\"\",\"\",G12*H12)","v":{"$error":"#REF!"}}]
[null,null,"Soil Organic Matter",null,{"$f":"'Page 2'!M24","v":{"$error":"#REF!"}}]
[null,null,"Microtopography",null,{"$f":"'Page 2'!M26","v":""}]
[null,null,"Organic Matter Accumulation",null,{"$f":"'Page 2'!M30","v":""}]
{"$rows_left_out":35}
{"sheet":"Plants table","index":5,"n_rows":3215,"n_cols":10,"rows_kept":3215,"cut":false,"hidden":false,"merged":[]}
["Scientific Name","Family","Native?","C",null,"EMP","Common Name","Comments","Sources used:","https://universalfqa.org/view_database/197"]
["Salix nigra","Salicaceae","native",2,null,"OBL","Black Willow",null,null,"https://cwbi-app.sec.usace.army.mil/nwpl_static/v34/home/home.html"]
[null,null,null,null,null,null,null,null,"Use top 5 rows to add extra c-values for missing plants. You may add more rows if necessary."]
[]
[]
[]
["Abies balsamea","Pinaceae","native",9,null,"FAC","Balsam Fir"]
["Abies balsamea var. phanerolepis","Pinaceae","native",9,null,"---","---"]
["Abutilon theophrasti","Malvaceae","non-native",0,null,"UPL","Velvetleaf"]
["Acalypha gracilens","Euphorbiaceae","native",3,null,"FAC","Slender Three-Seed-Mercury"]
["Acalypha ostryifolia","Euphorbiaceae","native",3,null,"---","---"]
["Acalypha rhomboidea","Euphorbiaceae","native",1,null,"FACU","Common Three-Seed-Mercury"]
["Acalypha virginica","Euphorbiaceae","native",3,null,"FACU","Virginia Three-Seed-Mercury"]
["Acanthospermum australe","Asteraceae","non-native",0,null,"---","---"]
["Acer campestre","Aceraceae","non-native",0,null,"---","---"]
{"$rows_left_out":3200}