{"text_format":"1","workbook":"xlsx","n_sheets":2,"sheets":["ESD Summary","Sheet1"],"not_rendered":{"charts":0,"images":2,"macros":1,"external_links":0,"defined_names":1,"comments":0,"pivot_tables":0},"unopened":[],"bounds":{"document_bytes":16777216,"sheet_cells":100000,"rows_first":2000,"rows_last":500,"rows_between":2000,"halvings":0,"cell_chars":16384,"cell_head_chars":4096},"cells_cut":0,"cells_raw":0,"read":"whole","date_system":"1900"}

{"sheet":"ESD Summary","index":0,"n_rows":1245,"n_cols":33,"rows_kept":1245,"cut":false,"hidden":false,"merged":[[4,7,4,9],[95,20,98,24],[100,20,103,24],[105,20,108,24],[110,20,113,24],[99,20,99,23],[109,20,109,23],[75,20,78,24],[80,20,83,24],[64,20,64,23],[85,20,88,24],[104,20,104,23],[89,20,89,23],[84,20,84,23],[79,20,79,23],[94,20,94,23],[90,20,93,24],[35,20,38,24],[40,20,43,24],[9,4,10,4],[24,20,24,23],[19,20,19,23],[13,20,13,23],[9,19,10,19],[29,20,29,23],[34,20,34,23],[9,7,9,8],[0,28,0,30],[1,28,1,30],[2,28,2,30],[3,28,3,30],[4,28,4,30],[20,20,23,24],[5,1,5,24],[7,10,8,10],[7,4,8,4],[7,1,10,1],[7,9,8,9],[9,2,10,2],[9,17,10,17],[9,9,10,9],[6,1,6,13],[7,15,8,15],[9,5,9,6],[7,5,8,5],[7,3,8,3],[59,20,59,23],[69,20,69,23],[50,20,53,24],[74,20,74,23],[45,20,48,24],[55,20,58,24],[60,20,63,24],[54,20,54,23],[65,20,68,24],[70,20,73,24],[14,20,18,24],[9,13,10,13],[49,20,49,23],[6,20,8,23],[7,17,8,17],[7,18,8,18],[10,22,10,23],[9,20,9,21],[9,22,9,23],[6,14,6,19],[44,20,44,23],[9,3,10,3],[10,20,10,21],[7,11,8,11],[7,19,8,19],[25,20,28,24],[6,24,12,24],[7,13,8,13],[9,14,12,14],[7,14,8,14],[39,20,39,23],[9,16,10,16],[9,10,10,10],[9,11,10,11],[11,22,12,23],[11,20,12,21],[30,20,33,24],[9,15,12,15],[9,18,10,18],[9,12,10,12],[2,10,2,20],[3,10,3,14],[4,10,4,14],[0,1,0,24],[7,7,8,7],[7,8,8,8],[7,12,8,12],[7,16,8,16],[7,2,8,2],[7,6,8,6]]}
[null,"MDE Sediment & Stormwater Plan Review\nfor State & Federal Projects",null,null,null,null,null,null,null,null,null,null,null,null,null,null,null,null,null,null,null,null,null,null,null,null,null,null,null,null,null,null,{"$f":"H5&\" \"&K5","v":"MDE Tracking Number: "}]
[null,null,null,null,null,null,null,null,null,null,null,null,null,null,null,null,null,null,null,null,null,null,null,"Job #",null,null,null,null,null,null,null,null,{"$f":"LEFT(H5,3)","v":"MDE"}]
[null,null,null,null,null,null,null,null,null,"Project Description:",null,null,null,null,null,null,null,null,null,null,null,null,null,"Date:"]
[null,null,null,null,null,null,null,null,null,"Contract Number:",null,null,null,null,null,null,null,null,null,null,null,null,null,"Designed by:"]
[null,null,null,null,null,null,null,"MDE Tracking Number:",null,null,null,null,null,null,null,null,null,null,null,null,null,null,null,"Checked by:"]
[null,"ESD SUMMARY SHEET"]
[null,"Required ESD Management",null,null,null,null,null,null,null,null,null,null,null,null,"Provided ESD Management",null,null,null,null,null,"ESDv and Rev \nRequirements",null,null,null,"Is the POI Requirement met?"]
[null,"Point of Investigation","Col. 1","Col. 2","Col. 3","Col. 4a","Col. 4b","Col. 5a","Col. 5b","Col. 6","Col. 7","Col. 8","Col. 9","Col. 10","Col. 11","Col. 12","Col. 13","Col. 14","Col. 15","Col. 16"]
[]
[null,null,"IARTRE-DEV’L","IARTNEW","ESDV RE-DEV'L\n(PE=1.0 in)","ESDV reducedAi",null,"ESDV NEW",null,"ESDV SHIFT\n(PE = 2.6 in)","ESDV Loss","Required ESDV\nfor POI      =4b\n+5b+6\n+7","Required ESDV\nfor PROJECT        =Σ3+Σ4a\n+Σ5a+Σ5b\n+Σ6+Σ7","Required\nReV","Type of Practice","BMP Number","PE Treated by Practice","Provided\nESDV","ESDV from WQ Bank Debit","Provided \nReV","ESDv Project  Requirement ",null,"Rev Project Requirement "]
[null,null,null,null,null,"Reduction Applied to Project\n(PE = 1.0 in)  ","Reduction Applied to POI\n(PE = 2.6 in)  ","For 3.3.B Waivers\n(PE = 1 in)","(PE =\n 2 to 2.6 in)",null,null,null,null,null,null,null,null,null,null,null,{"$f":"\"Provided ESDv \"&(R12+S12)&\" \"&\"cf\n\"&\" \"&IF((R12-M12+S12)>=0,\">=\",\"<\")&\"\n \"&M12&\" \"&\"cf\"","v":"Provided ESDv 0 cf\n >=\n 0 cf"},null,{"$f":"\" Provided Rev   \"\n&T12&\" \"&\"cf\n\"&IF((T12-N12)>=0,\">=\",\"<\")&\"\n \"&N12&\" \"&\"cf\"","v":" Provided Rev   0 cf\n>=\n 0 cf"}]
[null,"Total ≫≫",{"$f":"Sheet1!R32","v":0},{"$f":"Sheet1!S32","v":0},{"$f":"Sheet1!T32","v":0},{"$f":"Sheet1!U32","v":0},null,{"$f":"Sheet1!W32","v":0},{"$f":"Sheet1!X32","v":0},{"$f":"Sheet1!Y32","v":0},{"$f":"Sheet1!Z32","v":0},null,{"$f":"E12+F12+H12+I12+J12+K12","v":0},{"$f":"Sheet1!P32","v":0},null,null,null,{"$f":"Sheet1!L32","v":0},null,{"$f":"Sheet1!O32","v":0},{"$f":"IF((R12-M12+S12)<0,\"CHECK: FAIL\",\"CHECK: OK\")","v":"CHECK: OK"},null,{"$f":"IF((T12-N12)<0,\"CHECK: FAIL\",\"CHECK: OK\")","v":"CHECK: OK"},null,null,null,null,null,null,{"$f":"OR(AND(H14>0,J14<=0,J14=ROUND(J14,1),AND(OR(H14=\"\",H14=0),J14>=0,J14=ROUND(J14,1))))","v":false}]
[null,"Units ≫≫","acres","acres","cubic feet","cubic feet","cubic feet","cubic feet","cubic feet","Cubic feet","Cubic feet","Cubic feet","Cubic feet","Cubic feet",null,null,"inches","Cubic feet","Cubic feet","Cubic feet",null,null,null,null,null,null,null,null,null,{"$f":"AND(OR(AND(H14>0,J14<=0),AND(H14=\"\",H14=0,J14>=0),(J14=ROUND(J14,1))))","v":true}]
[null,null,null,null,null,null,null,null,null,null,null,{"$f":"IF((G14+I14+J14+K14)>0,(G14+I14+J14+K14),0)","v":0},null,0,null,null,null,null,null,null,{"$f":"IF($B14=\"\",\"\",\"Provided ESDv at POI\"&\" \"&INDEX(Sheet1!$L$2:$L$31,MATCH('ESD Summary'!$B14,Sheet1!$J$2:$J$31,0))&\" \"&\"cf\"&\" \"&IF((Z14)>=0,\">=\",\"<\")&\" \"&L14&\" \"&\"cf\")","v":""},null,null,null,{"$f":"IF(B14=\"\",\"\",INDEX(Sheet1!$N$2:$N$31,MATCH('ESD Summary'!B14,Sheet1!$J$2:$J$31,0)))","v":""},{"$f":"INDEX(Sheet1!$L$2:$L$31,MATCH('ESD Summary'!$B14,Sheet1!$J$2:$J$31,0))-INDEX(Sheet1!$M$2:$M$31,MATCH('ESD Summary'!$B14,Sheet1!$J$2:$J$31,0))","v":0},null,null,null,{"$f":"AND(OR(AND(H14>0,J14<=0),AND(OR(H14=\"\",H14=0))),J14=ROUND(J14,1))","v":true}]
[null,null,null,null,null,null,null,null,null,null,null,null,null,null,null,null,null,null,null,null,{"$f":"IF(B14=\"\",\"\",IF(AND((R12-M12+S12)<0,Z14<0),Sheet1!$AY$1,IF((R12-M12+S12)<0,Sheet1!$AQ$1,IF(Z14<0,Sheet1!$AI$1,\"\"))))","v":""},null,null,null,null,{"$f":"INDEX(Sheet1!$L$2:$L$31,MATCH('ESD Summary'!$B15,Sheet1!$J$2:$J$31,0))-INDEX(Sheet1!$M$2:$M$31,MATCH('ESD Summary'!$B15,Sheet1!$J$2:$J$31,0))","v":0},null,null,null,null,{"$f":"AND(OR(H15=\"\",H15=0,J15=0),OR(J15=ROUND(J15,1)))","v":true}]
{"$rows_left_out":1231}
{"sheet":"Sheet1","index":1,"n_rows":200,"n_cols":51,"rows_kept":200,"cut":false,"hidden":false,"merged":[[0,34,0,41],[0,42,0,49],[0,50,0,57]]}
[null,null,null,null,null,"IAT","Treated \nESDV","Treated \nReV\n","Required ESDV for POI",{"$f":"30-COUNTBLANK(J3:J31)","v":1},"IAT","Treated \nESDV","Required ESDV for POI","Treated \nESDVIARTNEW ","Treated \nRev","Required\nReV",null,"IARTRE-DEV’L","IARTNEW","ESDVRE-DEV'L  (PE=1.0 in)","Reduction applied to Project  (PE=1.0 in)  ","Reduction applied to POI        (PE=2.6 in)  ","For 3.3.B Waivers                  (PE=1 in)","(PE= 2 to 2.6 in)","ESDVshift   (PE = 2 to 2.6 in)","ESDVLWQ",null,null,null,"A-1. Green Roofs ",null,null,null,{"$f":"LEFT(AD1,3)","v":"A-1"},"ALERT! ≫≫≫ For POI\nAdditional management is necessary.\nPlease provide additional ESD practices \nOR provide a structural facility for PE over 1.0 inch \nunless a variance has been granted from MDE. ",null,null,null,null,null,null,null,"ALERT! ≫≫≫ For PROJECT\nAdditional management is necessary.\nPlease provide additional ESD practices \nOR provide a structural facility for PE over 1.0 inch \nunless a variance has been granted from MDE. ",null,null,null,null,null,null,null,"ALERT! ≫≫≫ For POI & PROJECT\nAdditional management is necessary for POI/PROJECT.\nPlease provide additional ESD practices \nOR provide a structural facility for PE over 1.0 inch \nunless a variance has been granted from MDE. "]
[{"$f":"ROW('ESD Summary'!B14)","v":14},{"$f":"ADDRESS(A2,2)","v":"$B$14"},{"$f":"INDIRECT(\"'ESD Summary'!\"&B2)","v":0},1,{"$f":"C2","v":0},{"$f":"IF(INDIRECT(\"'ESD Summary'!P\"&$A2)=\"\",0,INDIRECT(\"'ESD Summary'!P\"&$A2))","v":0},{"$f":"IF(INDIRECT(\"'ESD Summary'!R\"&$A2)=\"\",0,INDIRECT(\"'ESD Summary'!R\"&$A2))","v":0},{"$f":"IF(INDIRECT(\"'ESD Summary'!t\"&$A2)=\"\",0,INDIRECT(\"'ESD Summary'!t\"&$A2))","v":0},{"$f":"IF(INDIRECT(\"'ESD Summary'!L\"&$A2)=\"\",0,INDIRECT(\"'ESD Summary'!L\"&$A2))","v":0},{"$f":"IF(ISERROR(VLOOKUP(ROW()-1,$D$2:$E$200,2,FALSE)),\"\",VLOOKUP(ROW()-1,$D$2:$E$200,2,FALSE))","v":0},{"$f":"SUMPRODUCT(($E$2:$E$200=J2)*($F$2:$F$200))","v":0},{"$f":"SUMPRODUCT(($E$2:$E$200=J2)*($G$2:$G$200))","v":0},{"$f":"SUMPRODUCT(($E$2:$E$200=J2)*($I$2:$I$200))","v":0},{"$f":"IF(J2=\"\",\"\",IF(OR(M2=\"\",M2=0),\"YES\",IF((L2-M2)>=0,\"YES\",\"NO\")))","v":"YES"},{"$f":"SUMPRODUCT(($E$2:$E$200=J2)*($H$2:$H$200))","v":0},{"$f":"SUMPRODUCT(('ESD Summary'!$B$14:$B$291=Sheet1!$J2)*('ESD Summary'!N$14:N$291))","v":0},null,{"$f":"SUMPRODUCT(('ESD Summary'!$B$14:$B$291=Sheet1!$J2)*('ESD Summary'!C$14:C$291))","v":0},{"$f":"SUMPRODUCT(('ESD Summary'!$B$14:$B$291=Sheet1!$J2)*('ESD Summary'!D$14:D$291))","v":0},{"$f":"SUMPRODUCT(('ESD Summary'!$B$14:$B$291=Sheet1!$J2)*('ESD Summary'!E$14:E$291))","v":0},{"$f":"SUMPRODUCT(('ESD Summary'!$B$14:$B$291=Sheet1!$J2)*('ESD Summary'!F$14:F$291))","v":0},{"$f":"SUMPRODUCT(('ESD Summary'!$B$14:$B$291=Sheet1!$J2)*('ESD Summary'!G$14:G$291))","v":0},{"$f":"SUMPRODUCT(('ESD Summary'!$B$14:$B$291=Sheet1!$J2)*('ESD Summary'!H$14:H$291))","v":0},{"$f":"SUMPRODUCT(('ESD Summary'!$B$14:$B$291=Sheet1!$J2)*('ESD Summary'!I$14:I$291))","v":0},{"$f":"SUMPRODUCT(('ESD Summary'!$B$14:$B$291=Sheet1!$J2)*('ESD Summary'!J$14:J$291))","v":0},{"$f":"SUMPRODUCT(('ESD Summary'!$B$14:$B$291=Sheet1!$J2)*('ESD Summary'!K$14:K$291))","v":0},null,null,null,"A-2. Permeable Pavements ",null,null,null,"A-2"]
[{"$f":"A2+1","v":15},{"$f":"ADDRESS(A3,2)","v":"$B$15"},{"$f":"INDIRECT(\"'ESD Summary'!\"&B3)","v":0},{"$f":"IF(COUNTIF($E$2:E3,E3)=1,D2+1,D2)","v":1},{"$f":"IF(C3=0,E2,C3)","v":0},{"$f":"IF(INDIRECT(\"'ESD Summary'!P\"&$A3)=\"\",0,INDIRECT(\"'ESD Summary'!P\"&$A3))","v":0},{"$f":"IF(INDIRECT(\"'ESD Summary'!R\"&$A3)=\"\",0,INDIRECT(\"'ESD Summary'!R\"&$A3))","v":0},{"$f":"IF(INDIRECT(\"'ESD Summary'!t\"&$A3)=\"\",0,INDIRECT(\"'ESD Summary'!t\"&$A3))","v":0},{"$f":"IF(INDIRECT(\"'ESD Summary'!L\"&$A3)=\"\",0,INDIRECT(\"'ESD Summary'!L\"&$A3))","v":0},{"$f":"IF(ISERROR(VLOOKUP(ROW()-1,$D$2:$E$200,2,FALSE)),\"\",VLOOKUP(ROW()-1,$D$2:$E$200,2,FALSE))","v":""},{"$f":"SUMPRODUCT(($E$2:$E$200=J3)*($F$2:$F$200))","v":0},0,0,"",0,{"$f":"IF(J3=\"\",\"\",SUMPRODUCT(('ESD Summary'!$B$14:$B$291=Sheet1!$J3)*('ESD Summary'!N$14:N$291)))","v":""},null,{"$f":"SUMPRODUCT(('ESD Summary'!$B$14:$B$291=Sheet1!$J3)*('ESD Summary'!C$14:C$291))","v":0},{"$f":"SUMPRODUCT(('ESD Summary'!$B$14:$B$291=Sheet1!$J3)*('ESD Summary'!D$14:D$291))","v":0},{"$f":"SUMPRODUCT(('ESD Summary'!$B$14:$B$291=Sheet1!$J3)*('ESD Summary'!E$14:E$291))","v":0},{"$f":"SUMPRODUCT(('ESD Summary'!$B$14:$B$291=Sheet1!$J3)*('ESD Summary'!F$14:F$291))","v":0},{"$f":"SUMPRODUCT(('ESD Summary'!$B$14:$B$291=Sheet1!$J3)*('ESD Summary'!G$14:G$291))","v":0},{"$f":"SUMPRODUCT(('ESD Summary'!$B$14:$B$291=Sheet1!$J3)*('ESD Summary'!H$14:H$291))","v":0},{"$f":"SUMPRODUCT(('ESD Summary'!$B$14:$B$291=Sheet1!$J3)*('ESD Summary'!I$14:I$291))","v":0},{"$f":"SUMPRODUCT(('ESD Summary'!$B$14:$B$291=Sheet1!$J3)*('ESD Summary'!J$14:J$291))","v":0},{"$f":"SUMPRODUCT(('ESD Summary'!$B$14:$B$291=Sheet1!$J3)*('ESD Summary'!K$14:K$291))","v":0},null,null,null,"A-3. Reinforced Turf",null,null,null,"A-3"]
[{"$f":"A3+1","v":16},"$B$16",0,{"$f":"IF(COUNTIF($E$2:E4,E4)=1,D3+1,D3)","v":1},{"$f":"IF(C4=0,E3,C4)","v":0},0,0,0,0,"",{"$f":"SUMPRODUCT(($E$2:$E$200=J4)*($F$2:$F$200))","v":0},0,0,"",0,{"$f":"IF(J4=\"\",\"\",SUMPRODUCT(('ESD Summary'!$B$14:$B$291=Sheet1!$J4)*('ESD Summary'!N$14:N$291)))","v":""},null,{"$f":"SUMPRODUCT(('ESD Summary'!$B$14:$B$291=Sheet1!$J4)*('ESD Summary'!C$14:C$291))","v":0},{"$f":"SUMPRODUCT(('ESD Summary'!$B$14:$B$291=Sheet1!$J4)*('ESD Summary'!D$14:D$291))","v":0},{"$f":"SUMPRODUCT(('ESD Summary'!$B$14:$B$291=Sheet1!$J4)*('ESD Summary'!E$14:E$291))","v":0},{"$f":"SUMPRODUCT(('ESD Summary'!$B$14:$B$291=Sheet1!$J4)*('ESD Summary'!F$14:F$291))","v":0},{"$f":"SUMPRODUCT(('ESD Summary'!$B$14:$B$291=Sheet1!$J4)*('ESD Summary'!G$14:G$291))","v":0},{"$f":"SUMPRODUCT(('ESD Summary'!$B$14:$B$291=Sheet1!$J4)*('ESD Summary'!H$14:H$291))","v":0},{"$f":"SUMPRODUCT(('ESD Summary'!$B$14:$B$291=Sheet1!$J4)*('ESD Summary'!I$14:I$291))","v":0},{"$f":"SUMPRODUCT(('ESD Summary'!$B$14:$B$291=Sheet1!$J4)*('ESD Summary'!J$14:J$291))","v":0},{"$f":"SUMPRODUCT(('ESD Summary'!$B$14:$B$291=Sheet1!$J4)*('ESD Summary'!K$14:K$291))","v":0},null,null,null,"N-1. Disconnection of Rooftop Runoff",null,null,null,"N-1"]
[17,"$B$17",0,{"$f":"IF(COUNTIF($E$2:E5,E5)=1,D4+1,D4)","v":1},0,0,0,0,0,"",0,0,0,"",0,{"$f":"IF(J5=\"\",\"\",SUMPRODUCT(('ESD Summary'!$B$14:$B$291=Sheet1!$J5)*('ESD Summary'!N$14:N$291)))","v":""},null,{"$f":"SUMPRODUCT(('ESD Summary'!$B$14:$B$291=Sheet1!$J5)*('ESD Summary'!C$14:C$291))","v":0},{"$f":"SUMPRODUCT(('ESD Summary'!$B$14:$B$291=Sheet1!$J5)*('ESD Summary'!D$14:D$291))","v":0},{"$f":"SUMPRODUCT(('ESD Summary'!$B$14:$B$291=Sheet1!$J5)*('ESD Summary'!E$14:E$291))","v":0},{"$f":"SUMPRODUCT(('ESD Summary'!$B$14:$B$291=Sheet1!$J5)*('ESD Summary'!F$14:F$291))","v":0},{"$f":"SUMPRODUCT(('ESD Summary'!$B$14:$B$291=Sheet1!$J5)*('ESD Summary'!G$14:G$291))","v":0},{"$f":"SUMPRODUCT(('ESD Summary'!$B$14:$B$291=Sheet1!$J5)*('ESD Summary'!H$14:H$291))","v":0},{"$f":"SUMPRODUCT(('ESD Summary'!$B$14:$B$291=Sheet1!$J5)*('ESD Summary'!I$14:I$291))","v":0},{"$f":"SUMPRODUCT(('ESD Summary'!$B$14:$B$291=Sheet1!$J5)*('ESD Summary'!J$14:J$291))","v":0},{"$f":"SUMPRODUCT(('ESD Summary'!$B$14:$B$291=Sheet1!$J5)*('ESD Summary'!K$14:K$291))","v":0},null,null,null,"N-2. Disconnection of Non-Rooftop Runoff",null,null,null,"N-2"]
[18,"$B$18",0,{"$f":"IF(COUNTIF($E$2:E6,E6)=1,D5+1,D5)","v":1},0,0,0,0,0,"",0,0,0,"",0,{"$f":"IF(J6=\"\",\"\",SUMPRODUCT(('ESD Summary'!$B$14:$B$291=Sheet1!$J6)*('ESD Summary'!N$14:N$291)))","v":""},null,{"$f":"SUMPRODUCT(('ESD Summary'!$B$14:$B$291=Sheet1!$J6)*('ESD Summary'!C$14:C$291))","v":0},{"$f":"SUMPRODUCT(('ESD Summary'!$B$14:$B$291=Sheet1!$J6)*('ESD Summary'!D$14:D$291))","v":0},{"$f":"SUMPRODUCT(('ESD Summary'!$B$14:$B$291=Sheet1!$J6)*('ESD Summary'!E$14:E$291))","v":0},{"$f":"SUMPRODUCT(('ESD Summary'!$B$14:$B$291=Sheet1!$J6)*('ESD Summary'!F$14:F$291))","v":0},{"$f":"SUMPRODUCT(('ESD Summary'!$B$14:$B$291=Sheet1!$J6)*('ESD Summary'!G$14:G$291))","v":0},{"$f":"SUMPRODUCT(('ESD Summary'!$B$14:$B$291=Sheet1!$J6)*('ESD Summary'!H$14:H$291))","v":0},{"$f":"SUMPRODUCT(('ESD Summary'!$B$14:$B$291=Sheet1!$J6)*('ESD Summary'!I$14:I$291))","v":0},{"$f":"SUMPRODUCT(('ESD Summary'!$B$14:$B$291=Sheet1!$J6)*('ESD Summary'!J$14:J$291))","v":0},{"$f":"SUMPRODUCT(('ESD Summary'!$B$14:$B$291=Sheet1!$J6)*('ESD Summary'!K$14:K$291))","v":0},null,null,null,"N-3. Sheetflow to Conservation Areas",null,null,null,"N-3"]
[19,"$B$19",0,{"$f":"IF(COUNTIF($E$2:E7,E7)=1,D6+1,D6)","v":1},0,0,0,0,0,"",0,0,0,"",0,{"$f":"IF(J7=\"\",\"\",SUMPRODUCT(('ESD Summary'!$B$14:$B$291=Sheet1!$J7)*('ESD Summary'!N$14:N$291)))","v":""},null,{"$f":"SUMPRODUCT(('ESD Summary'!$B$14:$B$291=Sheet1!$J7)*('ESD Summary'!C$14:C$291))","v":0},{"$f":"SUMPRODUCT(('ESD Summary'!$B$14:$B$291=Sheet1!$J7)*('ESD Summary'!D$14:D$291))","v":0},{"$f":"SUMPRODUCT(('ESD Summary'!$B$14:$B$291=Sheet1!$J7)*('ESD Summary'!E$14:E$291))","v":0},{"$f":"SUMPRODUCT(('ESD Summary'!$B$14:$B$291=Sheet1!$J7)*('ESD Summary'!F$14:F$291))","v":0},{"$f":"SUMPRODUCT(('ESD Summary'!$B$14:$B$291=Sheet1!$J7)*('ESD Summary'!G$14:G$291))","v":0},{"$f":"SUMPRODUCT(('ESD Summary'!$B$14:$B$291=Sheet1!$J7)*('ESD Summary'!H$14:H$291))","v":0},{"$f":"SUMPRODUCT(('ESD Summary'!$B$14:$B$291=Sheet1!$J7)*('ESD Summary'!I$14:I$291))","v":0},{"$f":"SUMPRODUCT(('ESD Summary'!$B$14:$B$291=Sheet1!$J7)*('ESD Summary'!J$14:J$291))","v":0},{"$f":"SUMPRODUCT(('ESD Summary'!$B$14:$B$291=Sheet1!$J7)*('ESD Summary'!K$14:K$291))","v":0},null,null,null,"M-1. Rainwater Harvesting",null,null,null,"M-1"]
[20,"$B$20",0,{"$f":"IF(COUNTIF($E$2:E8,E8)=1,D7+1,D7)","v":1},0,0,0,0,0,"",0,0,0,"",0,{"$f":"IF(J8=\"\",\"\",SUMPRODUCT(('ESD Summary'!$B$14:$B$291=Sheet1!$J8)*('ESD Summary'!N$14:N$291)))","v":""},null,{"$f":"SUMPRODUCT(('ESD Summary'!$B$14:$B$291=Sheet1!$J8)*('ESD Summary'!C$14:C$291))","v":0},{"$f":"SUMPRODUCT(('ESD Summary'!$B$14:$B$291=Sheet1!$J8)*('ESD Summary'!D$14:D$291))","v":0},{"$f":"SUMPRODUCT(('ESD Summary'!$B$14:$B$291=Sheet1!$J8)*('ESD Summary'!E$14:E$291))","v":0},{"$f":"SUMPRODUCT(('ESD Summary'!$B$14:$B$291=Sheet1!$J8)*('ESD Summary'!F$14:F$291))","v":0},{"$f":"SUMPRODUCT(('ESD Summary'!$B$14:$B$291=Sheet1!$J8)*('ESD Summary'!G$14:G$291))","v":0},{"$f":"SUMPRODUCT(('ESD Summary'!$B$14:$B$291=Sheet1!$J8)*('ESD Summary'!H$14:H$291))","v":0},{"$f":"SUMPRODUCT(('ESD Summary'!$B$14:$B$291=Sheet1!$J8)*('ESD Summary'!I$14:I$291))","v":0},{"$f":"SUMPRODUCT(('ESD Summary'!$B$14:$B$291=Sheet1!$J8)*('ESD Summary'!J$14:J$291))","v":0},{"$f":"SUMPRODUCT(('ESD Summary'!$B$14:$B$291=Sheet1!$J8)*('ESD Summary'!K$14:K$291))","v":0},null,null,null,"M-2. Submerged Gravel Wetlands",null,null,null,"M-2"]
[21,"$B$21",0,{"$f":"IF(COUNTIF($E$2:E9,E9)=1,D8+1,D8)","v":1},0,0,0,0,0,"",0,0,0,"",0,{"$f":"IF(J9=\"\",\"\",SUMPRODUCT(('ESD Summary'!$B$14:$B$291=Sheet1!$J9)*('ESD Summary'!N$14:N$291)))","v":""},null,{"$f":"SUMPRODUCT(('ESD Summary'!$B$14:$B$291=Sheet1!$J9)*('ESD Summary'!C$14:C$291))","v":0},{"$f":"SUMPRODUCT(('ESD Summary'!$B$14:$B$291=Sheet1!$J9)*('ESD Summary'!D$14:D$291))","v":0},{"$f":"SUMPRODUCT(('ESD Summary'!$B$14:$B$291=Sheet1!$J9)*('ESD Summary'!E$14:E$291))","v":0},{"$f":"SUMPRODUCT(('ESD Summary'!$B$14:$B$291=Sheet1!$J9)*('ESD Summary'!F$14:F$291))","v":0},{"$f":"SUMPRODUCT(('ESD Summary'!$B$14:$B$291=Sheet1!$J9)*('ESD Summary'!G$14:G$291))","v":0},{"$f":"SUMPRODUCT(('ESD Summary'!$B$14:$B$291=Sheet1!$J9)*('ESD Summary'!H$14:H$291))","v":0},{"$f":"SUMPRODUCT(('ESD Summary'!$B$14:$B$291=Sheet1!$J9)*('ESD Summary'!I$14:I$291))","v":0},{"$f":"SUMPRODUCT(('ESD Summary'!$B$14:$B$291=Sheet1!$J9)*('ESD Summary'!J$14:J$291))","v":0},{"$f":"SUMPRODUCT(('ESD Summary'!$B$14:$B$291=Sheet1!$J9)*('ESD Summary'!K$14:K$291))","v":0},null,null,null,"M-3. Landscape Infiltration",null,null,null,"M-3"]
[22,"$B$22",0,{"$f":"IF(COUNTIF($E$2:E10,E10)=1,D9+1,D9)","v":1},0,0,0,0,0,"",0,0,0,"",0,{"$f":"IF(J10=\"\",\"\",SUMPRODUCT(('ESD Summary'!$B$14:$B$291=Sheet1!$J10)*('ESD Summary'!N$14:N$291)))","v":""},null,{"$f":"SUMPRODUCT(('ESD Summary'!$B$14:$B$291=Sheet1!$J10)*('ESD Summary'!C$14:C$291))","v":0},{"$f":"SUMPRODUCT(('ESD Summary'!$B$14:$B$291=Sheet1!$J10)*('ESD Summary'!D$14:D$291))","v":0},{"$f":"SUMPRODUCT(('ESD Summary'!$B$14:$B$291=Sheet1!$J10)*('ESD Summary'!E$14:E$291))","v":0},{"$f":"SUMPRODUCT(('ESD Summary'!$B$14:$B$291=Sheet1!$J10)*('ESD Summary'!F$14:F$291))","v":0},{"$f":"SUMPRODUCT(('ESD Summary'!$B$14:$B$291=Sheet1!$J10)*('ESD Summary'!G$14:G$291))","v":0},{"$f":"SUMPRODUCT(('ESD Summary'!$B$14:$B$291=Sheet1!$J10)*('ESD Summary'!H$14:H$291))","v":0},{"$f":"SUMPRODUCT(('ESD Summary'!$B$14:$B$291=Sheet1!$J10)*('ESD Summary'!I$14:I$291))","v":0},{"$f":"SUMPRODUCT(('ESD Summary'!$B$14:$B$291=Sheet1!$J10)*('ESD Summary'!J$14:J$291))","v":0},{"$f":"SUMPRODUCT(('ESD Summary'!$B$14:$B$291=Sheet1!$J10)*('ESD Summary'!K$14:K$291))","v":0},null,null,null,"M-4. Infiltration Berms",null,null,null,"M-4"]
[23,"$B$23",0,{"$f":"IF(COUNTIF($E$2:E11,E11)=1,D10+1,D10)","v":1},0,0,0,0,0,"",0,0,0,"",0,{"$f":"IF(J11=\"\",\"\",SUMPRODUCT(('ESD Summary'!$B$14:$B$291=Sheet1!$J11)*('ESD Summary'!N$14:N$291)))","v":""},null,{"$f":"SUMPRODUCT(('ESD Summary'!$B$14:$B$291=Sheet1!$J11)*('ESD Summary'!C$14:C$291))","v":0},{"$f":"SUMPRODUCT(('ESD Summary'!$B$14:$B$291=Sheet1!$J11)*('ESD Summary'!D$14:D$291))","v":0},{"$f":"SUMPRODUCT(('ESD Summary'!$B$14:$B$291=Sheet1!$J11)*('ESD Summary'!E$14:E$291))","v":0},{"$f":"SUMPRODUCT(('ESD Summary'!$B$14:$B$291=Sheet1!$J11)*('ESD Summary'!F$14:F$291))","v":0},{"$f":"SUMPRODUCT(('ESD Summary'!$B$14:$B$291=Sheet1!$J11)*('ESD Summary'!G$14:G$291))","v":0},{"$f":"SUMPRODUCT(('ESD Summary'!$B$14:$B$291=Sheet1!$J11)*('ESD Summary'!H$14:H$291))","v":0},{"$f":"SUMPRODUCT(('ESD Summary'!$B$14:$B$291=Sheet1!$J11)*('ESD Summary'!I$14:I$291))","v":0},{"$f":"SUMPRODUCT(('ESD Summary'!$B$14:$B$291=Sheet1!$J11)*('ESD Summary'!J$14:J$291))","v":0},{"$f":"SUMPRODUCT(('ESD Summary'!$B$14:$B$291=Sheet1!$J11)*('ESD Summary'!K$14:K$291))","v":0},null,null,null,"M-5. Dry Wells",null,null,null,"M-5"]
[24,"$B$24",0,{"$f":"IF(COUNTIF($E$2:E12,E12)=1,D11+1,D11)","v":1},0,0,0,0,0,"",0,0,0,"",0,{"$f":"IF(J12=\"\",\"\",SUMPRODUCT(('ESD Summary'!$B$14:$B$291=Sheet1!$J12)*('ESD Summary'!N$14:N$291)))","v":""},null,{"$f":"SUMPRODUCT(('ESD Summary'!$B$14:$B$291=Sheet1!$J12)*('ESD Summary'!C$14:C$291))","v":0},{"$f":"SUMPRODUCT(('ESD Summary'!$B$14:$B$291=Sheet1!$J12)*('ESD Summary'!D$14:D$291))","v":0},{"$f":"SUMPRODUCT(('ESD Summary'!$B$14:$B$291=Sheet1!$J12)*('ESD Summary'!E$14:E$291))","v":0},{"$f":"SUMPRODUCT(('ESD Summary'!$B$14:$B$291=Sheet1!$J12)*('ESD Summary'!F$14:F$291))","v":0},{"$f":"SUMPRODUCT(('ESD Summary'!$B$14:$B$291=Sheet1!$J12)*('ESD Summary'!G$14:G$291))","v":0},{"$f":"SUMPRODUCT(('ESD Summary'!$B$14:$B$291=Sheet1!$J12)*('ESD Summary'!H$14:H$291))","v":0},{"$f":"SUMPRODUCT(('ESD Summary'!$B$14:$B$291=Sheet1!$J12)*('ESD Summary'!I$14:I$291))","v":0},{"$f":"SUMPRODUCT(('ESD Summary'!$B$14:$B$291=Sheet1!$J12)*('ESD Summary'!J$14:J$291))","v":0},{"$f":"SUMPRODUCT(('ESD Summary'!$B$14:$B$291=Sheet1!$J12)*('ESD Summary'!K$14:K$291))","v":0},null,null,null,"M-6. Micro-Bioretention",null,null,null,"M-6"]
[25,"$B$25",0,{"$f":"IF(COUNTIF($E$2:E13,E13)=1,D12+1,D12)","v":1},0,0,0,0,0,"",0,0,0,"",0,{"$f":"IF(J13=\"\",\"\",SUMPRODUCT(('ESD Summary'!$B$14:$B$291=Sheet1!$J13)*('ESD Summary'!N$14:N$291)))","v":""},null,{"$f":"SUMPRODUCT(('ESD Summary'!$B$14:$B$291=Sheet1!$J13)*('ESD Summary'!C$14:C$291))","v":0},{"$f":"SUMPRODUCT(('ESD Summary'!$B$14:$B$291=Sheet1!$J13)*('ESD Summary'!D$14:D$291))","v":0},{"$f":"SUMPRODUCT(('ESD Summary'!$B$14:$B$291=Sheet1!$J13)*('ESD Summary'!E$14:E$291))","v":0},{"$f":"SUMPRODUCT(('ESD Summary'!$B$14:$B$291=Sheet1!$J13)*('ESD Summary'!F$14:F$291))","v":0},{"$f":"SUMPRODUCT(('ESD Summary'!$B$14:$B$291=Sheet1!$J13)*('ESD Summary'!G$14:G$291))","v":0},{"$f":"SUMPRODUCT(('ESD Summary'!$B$14:$B$291=Sheet1!$J13)*('ESD Summary'!H$14:H$291))","v":0},{"$f":"SUMPRODUCT(('ESD Summary'!$B$14:$B$291=Sheet1!$J13)*('ESD Summary'!I$14:I$291))","v":0},{"$f":"SUMPRODUCT(('ESD Summary'!$B$14:$B$291=Sheet1!$J13)*('ESD Summary'!J$14:J$291))","v":0},{"$f":"SUMPRODUCT(('ESD Summary'!$B$14:$B$291=Sheet1!$J13)*('ESD Summary'!K$14:K$291))","v":0},null,null,null,"M-7. Rain Gardens",null,null,null,"M-7"]
[26,"$B$26",0,{"$f":"IF(COUNTIF($E$2:E14,E14)=1,D13+1,D13)","v":1},0,0,0,0,0,"",0,0,0,"",0,{"$f":"IF(J14=\"\",\"\",SUMPRODUCT(('ESD Summary'!$B$14:$B$291=Sheet1!$J14)*('ESD Summary'!N$14:N$291)))","v":""},null,{"$f":"SUMPRODUCT(('ESD Summary'!$B$14:$B$291=Sheet1!$J14)*('ESD Summary'!C$14:C$291))","v":0},{"$f":"SUMPRODUCT(('ESD Summary'!$B$14:$B$291=Sheet1!$J14)*('ESD Summary'!D$14:D$291))","v":0},{"$f":"SUMPRODUCT(('ESD Summary'!$B$14:$B$291=Sheet1!$J14)*('ESD Summary'!E$14:E$291))","v":0},{"$f":"SUMPRODUCT(('ESD Summary'!$B$14:$B$291=Sheet1!$J14)*('ESD Summary'!F$14:F$291))","v":0},{"$f":"SUMPRODUCT(('ESD Summary'!$B$14:$B$291=Sheet1!$J14)*('ESD Summary'!G$14:G$291))","v":0},{"$f":"SUMPRODUCT(('ESD Summary'!$B$14:$B$291=Sheet1!$J14)*('ESD Summary'!H$14:H$291))","v":0},{"$f":"SUMPRODUCT(('ESD Summary'!$B$14:$B$291=Sheet1!$J14)*('ESD Summary'!I$14:I$291))","v":0},{"$f":"SUMPRODUCT(('ESD Summary'!$B$14:$B$291=Sheet1!$J14)*('ESD Summary'!J$14:J$291))","v":0},{"$f":"SUMPRODUCT(('ESD Summary'!$B$14:$B$291=Sheet1!$J14)*('ESD Summary'!K$14:K$291))","v":0},null,null,null,"M-8 G. Swales",null,null,null,{"$f":"LEFT(AD14,5)","v":"M-8 G"}]
[27,"$B$27",0,{"$f":"IF(COUNTIF($E$2:E15,E15)=1,D14+1,D14)","v":1},0,0,0,0,0,"",0,0,0,"",0,{"$f":"IF(J15=\"\",\"\",SUMPRODUCT(('ESD Summary'!$B$14:$B$291=Sheet1!$J15)*('ESD Summary'!N$14:N$291)))","v":""},null,{"$f":"SUMPRODUCT(('ESD Summary'!$B$14:$B$291=Sheet1!$J15)*('ESD Summary'!C$14:C$291))","v":0},{"$f":"SUMPRODUCT(('ESD Summary'!$B$14:$B$291=Sheet1!$J15)*('ESD Summary'!D$14:D$291))","v":0},{"$f":"SUMPRODUCT(('ESD Summary'!$B$14:$B$291=Sheet1!$J15)*('ESD Summary'!E$14:E$291))","v":0},{"$f":"SUMPRODUCT(('ESD Summary'!$B$14:$B$291=Sheet1!$J15)*('ESD Summary'!F$14:F$291))","v":0},{"$f":"SUMPRODUCT(('ESD Summary'!$B$14:$B$291=Sheet1!$J15)*('ESD Summary'!G$14:G$291))","v":0},{"$f":"SUMPRODUCT(('ESD Summary'!$B$14:$B$291=Sheet1!$J15)*('ESD Summary'!H$14:H$291))","v":0},{"$f":"SUMPRODUCT(('ESD Summary'!$B$14:$B$291=Sheet1!$J15)*('ESD Summary'!I$14:I$291))","v":0},{"$f":"SUMPRODUCT(('ESD Summary'!$B$14:$B$291=Sheet1!$J15)*('ESD Summary'!J$14:J$291))","v":0},{"$f":"SUMPRODUCT(('ESD Summary'!$B$14:$B$291=Sheet1!$J15)*('ESD Summary'!K$14:K$291))","v":0},null,null,null,"M-8 B. Swales",null,null,null,{"$f":"LEFT(AD15,5)","v":"M-8 B"}]
{"$rows_left_out":185}