{"text_format":"1","workbook":"xlsx","n_sheets":6,"sheets":["Read Me","Multiple Scenarios","Over 20 Scenarios","Summary Sheet","Acute Dataset","Chronic Dataset"],"not_rendered":{"charts":0,"images":6,"macros":1,"external_links":0,"defined_names":0,"comments":0,"pivot_tables":0},"unopened":[],"bounds":{"document_bytes":16777216,"sheet_cells":100000,"rows_first":2000,"rows_last":500,"rows_between":2000,"halvings":0,"cell_chars":16384,"cell_head_chars":4096},"cells_cut":0,"cells_raw":0,"read":"whole","date_system":"1900"}

{"sheet":"Read Me","index":0,"n_rows":124,"n_cols":1,"rows_kept":124,"cut":false,"hidden":false,"merged":[[103,0,103,23],[107,0,107,23],[123,0,123,23],[3,0,3,23],[6,0,6,23],[17,0,17,23],[27,0,27,23],[47,0,47,23],[67,0,67,23]]}
["Guidance for use of the Aluminun Criteria Calculator V.2.0.Macro"]
[]
["Introduction"]
["To faciliate adoption of the 2018 aluminum criteria, EPA developed a macro-enabled Excel file that allows users to caclulate multiple criteria values for various water chemistry scenarios. The draft aluminum criteria are dependent on the hardness, pH and dissolved organic carbon (DOC) of the site water. The Excel file also provides the acute and chronic datasets used to calculate the values, the formulas used to normalize the data, and the assumptions made on missing water chemistry parameters for added transparency. This guidance document outlines how users can calculate criteria values for aluminum using this Excel file. Additionaly acute and chronic criteria values for various scenarios are also provided in Appendix K of the aluminum ambient water quality criteria document."]
[]
["Getting Started – Initial Steps"]
["Download the Excel file from the docket or aluminum criteria website and save on your hard drive. Depending on the security settings on your computer you will need to hit one or both of the, “Enable Editing” and “Enable Content” buttons before use (see figure below)."]
[]
[]
[]
[]
[]
[]
[]
[]
{"$rows_left_out":110}
{"sheet":"Multiple Scenarios","index":1,"n_rows":29,"n_cols":35,"rows_kept":29,"cut":false,"hidden":false,"merged":[[8,24,8,25],[8,27,8,28],[8,30,8,31],[8,33,8,34],[8,11,8,12],[8,14,8,15],[8,17,8,18],[8,20,8,21],[7,10,7,12],[7,13,7,15],[7,19,7,21],[6,1,6,4],[6,10,6,21],[7,16,7,18],[6,23,6,34],[7,23,7,25],[7,26,7,28],[7,29,7,31],[7,32,7,34]]}
[null,null,null,null,"All concentrations reported are µg/L total Aluminum"]
[]
[null,null,null,null,"<-----Click Button after entering data"]
[]
[]
[]
[null,"ENTER DATA HERE",null,null,null,null,null,null,null,null,"ACUTE",null,null,null,null,null,null,null,null,null,null,null,null,"CHRONIC"]
[null,null,null,null,null,null,null,null,null,null,"Rank 1",null,null,"Rank 2",null,null,"Rank 3",null,null,"Rank 4",null,null,null,"Rank 1",null,null,"Rank 2",null,null,"Rank 3",null,null,"Rank 4"]
[null,"SiteName","DOC\n(mg/L)","Total Hardness\n(mg/L as CaCO3)","pH",null,"FAV","CMC","CCC","Flag","Genus","GMAV",null,"Genus","GMAV",null,"Genus","GMAV",null,"Genus","GMAV",null,null,"Genus","GMCV",null,"Genus","GMCV",null,"Genus","GMCV",null,"Genus","GMCV"]
[null,"Site 1",1,25,7,7542.8737034161522,1235.0854885898855,620,300,{"$f":"IF(OR(C10>12,D10>430,E10<6,E10>8.2),\"Outside model inputs\",\" \")","v":" "},"Daphnia","",1196.7565860179077,"Micropterus","",2148.0125447848536,"Oncorhynchus","",2381.2821602543904,"Ceriodaphnia","",4000.0101878769487,null,"Salmo","",312.32701795429676,"Salvelinus","",458.82852674817599,"Daphnia","",507.18177535950741,"Lampsilis","",528.21056950795241]
[null,"Site 2",1,50,7,7542.8737034161522,1572.911407679268,790,340,{"$f":"IF(OR(C11>12,D11>430,E11<6,E11>8.2),\"Outside model inputs\",\" \")","v":" "},"Daphnia","",1668.0120898410823,"Micropterus","",2533.2727549518104,"Oncorhynchus","",2808.3808137300452,"Ceriodaphnia","",5575.1231543808863,null,"Salmo","",368.34492756568761,"Salvelinus","",541.12244773796294,"Daphnia","",706.89841437318262,"Lampsilis","",736.2078690143295]
[null,"Site 3",1,100,7,7542.8737034161522,1960.7253936241273,980,380," ","Daphnia","",2324.837284676019,"Micropterus","",2987.6319235481492,"Oncorhynchus","",3312.0824262524493,"Ceriodaphnia","",7770.4797554555653,null,"Salmo","",434.41001855057362,"Salvelinus","",638.17632596029205,"Daphnia","",985.25892001760678,"Lampsilis","",1026.1097707747783]
[null,"Site 4",1,150,7,7542.8737034161522,2210.7541738487143,1100,400," ","Daphnia","",2823.1910925627026,"Micropterus","",3290.3099515003423,"Oncorhynchus","",3647.6306473340542,"Ceriodaphnia","",9436.1654362395857,null,"Salmo","",478.42024842568037,"Salvelinus","",702.83019121891255,"Daphnia","",1196.4597372883579,"Lampsilis","",1246.067406066491]
[null,"Site 5",1,100,7,7542.8737034161522,1960.7253936241273,980,380," ","Daphnia","",2324.837284676019,"Micropterus","",2987.6319235481492,"Oncorhynchus","",3312.0824262524493,"Ceriodaphnia","",7770.4797554555653,null,"Salmo","",434.41001855057362,"Salvelinus","",638.17632596029205,"Daphnia","",985.25892001760678,"Lampsilis","",1026.1097707747783]
[null,"Site 6",1,100,7,7542.8737034161522,1960.7253936241273,980,380," ","Daphnia","",2324.837284676019,"Micropterus","",2987.6319235481492,"Oncorhynchus","",3312.0824262524493,"Ceriodaphnia","",7770.4797554555653,null,"Salmo","",434.41001855057362,"Salvelinus","",638.17632596029205,"Daphnia","",985.25892001760678,"Lampsilis","",1026.1097707747783]
{"$rows_left_out":15}
{"sheet":"Over 20 Scenarios","index":2,"n_rows":509,"n_cols":35,"rows_kept":509,"cut":false,"hidden":false,"merged":[[8,27,8,28],[8,30,8,31],[8,33,8,34],[8,11,8,12],[8,14,8,15],[8,17,8,18],[8,20,8,21],[8,24,8,25],[6,1,6,4],[6,10,6,21],[6,23,6,34],[7,10,7,12],[7,13,7,15],[7,16,7,18],[7,19,7,21],[7,23,7,25],[7,26,7,28],[7,29,7,31],[7,32,7,34]]}
[null,null,null,null,"All concentrations reported are µg/L total Aluminum"]
[]
[null,null,null,null,"<-----Click Button after entering data"]
[]
[]
[]
[null,"ENTER DATA HERE",null,null,null,null,null,null,null,null,"ACUTE",null,null,null,null,null,null,null,null,null,null,null,null,"CHRONIC"]
[null,null,null,null,null,null,null,null,null,null,"Rank 1",null,null,"Rank 2",null,null,"Rank 3",null,null,"Rank 4",null,null,null,"Rank 1",null,null,"Rank 2",null,null,"Rank 3",null,null,"Rank 4"]
[null,"SiteName","DOC\n(mg/L)","Total Hardness\n(mg/L as CaCO3)","pH",null,"FAV","CMC","CCC","Flag","Genus","GMAV",null,"Genus","GMAV",null,"Genus","GMAV",null,"Genus","GMAV",null,null,"Genus","GMCV",null,"Genus","GMCV",null,"Genus","GMCV",null,"Genus","GMCV"]
[null,"Site 1",1,100,7,7542.8737034161522,1960.7253936241273,980,380,{"$f":"IF(OR(C10>12,D10>430,E10<6,E10>8.2),\"Outside model inputs\",\" \")","v":" "},"Daphnia","",2324.837284676019,"Micropterus","",2987.6319235481492,"Oncorhynchus","",3312.0824262524493,"Ceriodaphnia","",7770.4797554555653,null,"Salmo","",434.41001855057362,"Salvelinus","",638.17632596029205,"Daphnia","",985.25892001760678,"Lampsilis","",1026.1097707747783]
[null,"Site 2",1,100,7,7542.8737034161522,1960.7253936241273,980,380,{"$f":"IF(OR(C11>12,D11>430,E11<6,E11>8.2),\"Outside model inputs\",\" \")","v":" "},"Daphnia","",2324.837284676019,"Micropterus","",2987.6319235481492,"Oncorhynchus","",3312.0824262524493,"Ceriodaphnia","",7770.4797554555653,null,"Salmo","",434.41001855057362,"Salvelinus","",638.17632596029205,"Daphnia","",985.25892001760678,"Lampsilis","",1026.1097707747783]
[null,"Site 3",1,100,7,7542.8737034161522,1960.7253936241273,980,380," ","Daphnia","",2324.837284676019,"Micropterus","",2987.6319235481492,"Oncorhynchus","",3312.0824262524493,"Ceriodaphnia","",7770.4797554555653,null,"Salmo","",434.41001855057362,"Salvelinus","",638.17632596029205,"Daphnia","",985.25892001760678,"Lampsilis","",1026.1097707747783]
[null,"Site 4",1,100,7,7542.8737034161522,1960.7253936241273,980,380," ","Daphnia","",2324.837284676019,"Micropterus","",2987.6319235481492,"Oncorhynchus","",3312.0824262524493,"Ceriodaphnia","",7770.4797554555653,null,"Salmo","",434.41001855057362,"Salvelinus","",638.17632596029205,"Daphnia","",985.25892001760678,"Lampsilis","",1026.1097707747783]
[null,"Site 5",1,100,7,7542.8737034161522,1960.7253936241273,980,380," ","Daphnia","",2324.837284676019,"Micropterus","",2987.6319235481492,"Oncorhynchus","",3312.0824262524493,"Ceriodaphnia","",7770.4797554555653,null,"Salmo","",434.41001855057362,"Salvelinus","",638.17632596029205,"Daphnia","",985.25892001760678,"Lampsilis","",1026.1097707747783]
[null,"Site 6",1,100,7,7542.8737034161522,1960.7253936241273,980,380," ","Daphnia","",2324.837284676019,"Micropterus","",2987.6319235481492,"Oncorhynchus","",3312.0824262524493,"Ceriodaphnia","",7770.4797554555653,null,"Salmo","",434.41001855057362,"Salvelinus","",638.17632596029205,"Daphnia","",985.25892001760678,"Lampsilis","",1026.1097707747783]
{"$rows_left_out":495}
{"sheet":"Summary Sheet","index":3,"n_rows":44,"n_cols":20,"rows_kept":44,"cut":false,"hidden":false,"merged":[[2,1,2,2]]}
[]
[null,null,null,null,null,null,"All concentrations reported are µg/L total Aluminum"]
[null,"Normalization Chemistry"]
[null,"pH:",7,{"$f":"IF(OR(C4<5,C4>9),\"Outside model inputs\",\" \")","v":" "},null,null,"FAV",{"$f":"E43","v":2829.2215246647734}]
[null,"Total Hardness:",300,{"$f":"IF(C5>428,\"Outside model inputs\",\" \")","v":" "},null,null,"CMC",{"$f":"ROUND(E44,2-(1+INT(LOG10(ABS(E44)))))","v":1400}]
[null,"DOC:",1,{"$f":"IF(C6>12.3,\"Outside model inputs\",\" \")","v":" "},null,null,"CCC",{"$f":"ROUND(O43,2-(1+INT(LOG10(ABS(O43)))))","v":440}]
[]
[]
[null,"Acute Ranked GMAV",null,null,null,null,null,null,null,null,null,"Chronic Ranked GMCV"]
[null,"Rank",null,"GMAV","Genus",null,null,null,null,null,null,"Rank",null,"GMCV","Genus"]
[null,20,{"$f":"IF(VLOOKUP(D11,'Acute Dataset'!O$5:Q$143,2,)=\">\",\">\",\"\")","v":""},{"$f":"SMALL('Acute Dataset'!O$5:O$143,'Summary Sheet'!B11)","v":202135.99697737375},{"$f":"VLOOKUP(D11,'Acute Dataset'!O$5:Q$143,3,FALSE)","v":"Melanoides"},{"$f":"VLOOKUP(D11,'Acute Dataset'!O$5:R$143,4,FALSE)","v":"Mollusk"},null,null,null,null,null,13,{"$f":"IF(VLOOKUP(N11,'Chronic Dataset'!O$5:Q$76,2,FALSE) =\">\",\">\",\"\")","v":""},{"$f":"SMALL('Chronic Dataset'!$O$5:$O$76,L11)","v":34720.40938168201},{"$f":"VLOOKUP(N11,'Chronic Dataset'!O$5:Q$76,3,FALSE)","v":"Aeolosoma"},{"$f":"VLOOKUP(N11,'Chronic Dataset'!O$5:R$76,4,FALSE)","v":"Invert"}]
[null,19,{"$f":"IF(VLOOKUP(D12,'Acute Dataset'!O$5:Q$143,2,)=\">\",\">\",\"\")","v":">"},{"$f":"SMALL('Acute Dataset'!O$5:O$143,'Summary Sheet'!B12)","v":119573.57964259433},{"$f":"VLOOKUP(D12,'Acute Dataset'!O$5:Q$143,3,FALSE)","v":"Paratanytarsus"},{"$f":"VLOOKUP(D12,'Acute Dataset'!O$5:R$143,4,FALSE)","v":"Invert"},null,null,null,null,null,12,{"$f":"IF(VLOOKUP(N12,'Chronic Dataset'!O$5:Q$76,2,FALSE) =\">\",\">\",\"\")","v":">"},{"$f":"SMALL('Chronic Dataset'!$O$5:$O$76,L12)","v":13877.214663251772},{"$f":"VLOOKUP(N12,'Chronic Dataset'!O$5:Q$76,3,FALSE)","v":"Rana"},{"$f":"VLOOKUP(N12,'Chronic Dataset'!O$5:R$76,4,FALSE)","v":"Amphib - Other Data"}]
[null,18,{"$f":"IF(VLOOKUP(D13,'Acute Dataset'!O$5:Q$143,2,)=\">\",\">\",\"\")","v":""},{"$f":"SMALL('Acute Dataset'!O$5:O$143,'Summary Sheet'!B13)","v":70846.905401769967},{"$f":"VLOOKUP(D13,'Acute Dataset'!O$5:Q$143,3,FALSE)","v":"Physa"},{"$f":"VLOOKUP(D13,'Acute Dataset'!O$5:R$143,4,FALSE)","v":"Mollusk"},null,null,null,null,null,11,{"$f":"IF(VLOOKUP(N13,'Chronic Dataset'!O$5:Q$76,2,FALSE) =\">\",\">\",\"\")","v":""},{"$f":"SMALL('Chronic Dataset'!$O$5:$O$76,L13)","v":8630.4409557603212},{"$f":"VLOOKUP(N13,'Chronic Dataset'!O$5:Q$76,3,FALSE)","v":"Chironomus"},{"$f":"VLOOKUP(N13,'Chronic Dataset'!O$5:R$76,4,FALSE)","v":"Invert"}]
[null,17,{"$f":"IF(VLOOKUP(D14,'Acute Dataset'!O$5:Q$143,2,)=\">\",\">\",\"\")","v":">"},{"$f":"SMALL('Acute Dataset'!O$5:O$143,'Summary Sheet'!B14)","v":49916.991084267444},{"$f":"VLOOKUP(D14,'Acute Dataset'!O$5:Q$143,3,FALSE)","v":"Lampsilis"},{"$f":"VLOOKUP(D14,'Acute Dataset'!O$5:R$143,4,FALSE)","v":"Mollusk"},null,null,null,null,null,10,{"$f":"IF(VLOOKUP(N14,'Chronic Dataset'!O$5:Q$76,2,FALSE) =\">\",\">\",\"\")","v":""},{"$f":"SMALL('Chronic Dataset'!$O$5:$O$76,L14)","v":5990.0338819298604},{"$f":"VLOOKUP(N14,'Chronic Dataset'!O$5:Q$76,3,FALSE)","v":"Brachionus"},{"$f":"VLOOKUP(N14,'Chronic Dataset'!O$5:R$76,4,FALSE)","v":"Invert"}]
[null,16,{"$f":"IF(VLOOKUP(D15,'Acute Dataset'!O$5:Q$143,2,)=\">\",\">\",\"\")","v":">"},{"$f":"SMALL('Acute Dataset'!O$5:O$143,'Summary Sheet'!B15)","v":46995.139115055659},{"$f":"VLOOKUP(D15,'Acute Dataset'!O$5:Q$143,3,FALSE)","v":"Hyalella"},{"$f":"VLOOKUP(D15,'Acute Dataset'!O$5:R$143,4,FALSE)","v":"Invert"},null,null,null,null,null,9,{"$f":"IF(VLOOKUP(N15,'Chronic Dataset'!O$5:Q$76,2,FALSE) =\">\",\">\",\"\")","v":""},{"$f":"SMALL('Chronic Dataset'!$O$5:$O$76,L15)","v":5278.9568861662583},{"$f":"VLOOKUP(N15,'Chronic Dataset'!O$5:Q$76,3,FALSE)","v":"Lymnaea"},{"$f":"VLOOKUP(N15,'Chronic Dataset'!O$5:R$76,4,FALSE)","v":"Mollusk"}]
{"$rows_left_out":30}
{"sheet":"Acute Dataset","index":4,"n_rows":150,"n_cols":20,"rows_kept":150,"cut":false,"hidden":false,"merged":[]}
[null,"Appendix A. Acceptable Acute Toxicity Data of Aluminum to Freshwater Aquatic Animals"]
[null,null,null,null,null,null,null,null,null,null,"Values in bold used in SMAV calculation"]
[null,"Species","Methoda","Total Hardness (mg/L as CaCO3)","pH","DOC\n(mg/L)",null,"LC50 or EC50 Conc. (µg/L)","Reference",null,"Normalized Conc. - LC50\n(µg/L)","Reason excluded from SMAV",null,"Species Mean Acute Value\n(µg/L)","Genus Mean Acute Value\n(µg/L)",null,"Genus",null,"DOC Note","Dilution water"]
[]
[null,"Worm, Nais elinguis","R, M, T",17.89,6.51,3.2,null,3874,"Shuhaimi-Othman et al. 2012a, 2013",null,{"$f":"EXP(LN(H5)-0.597*(LN(F5)-LN('Summary Sheet'!$C$6))-8.802*(E5-'Summary Sheet'!$C$4)-2.089*(LN(D5)-LN('Summary Sheet'!$C$5))+0.491*(E5^2-'Summary Sheet'!$C$4^2)+0.23*((E5*LN(D5)-'Summary Sheet'!$C$4*LN('Summary Sheet'!$C$5))))","v":15611.401397591006},null,null,{"$f":"GEOMEAN(K5)","v":15611.401397591006},{"$f":"N5","v":15611.401397591006},null,"Nais","Invert","Value is from Shuhaimi-Othman et al. 2013","Tap water (Malaysia)"]
[]
[null,"Snail, Physa sp. ","S, M, T",47.4,6.59,1.1000000000000001,">",23400,"Call 1984; Call et al. 1984",">",{"$f":"EXP(LN(H7)-0.597*(LN(F7)-LN('Summary Sheet'!$C$6))-8.802*(E7-'Summary Sheet'!$C$4)-2.089*(LN(D7)-LN('Summary Sheet'!$C$5))+0.491*(E7^2-'Summary Sheet'!$C$4^2)+0.23*((E7*LN(D7)-'Summary Sheet'!$C$4*LN('Summary Sheet'!$C$5))))","v":89016.044313163467},null,null,"-",null,null,"Physa",null,"Value is from 2007 FW Cu AWQC Appendix C recommendation","Raw Lake Superior water"]
[null,"Snail, Physa sp. ","S, M, T",47.4,7.55,1.1000000000000001,null,30600,"Call 1984; Call et al. 1984",null,{"$f":"EXP(LN(H8)-0.597*(LN(F8)-LN('Summary Sheet'!$C$6))-8.802*(E8-'Summary Sheet'!$C$4)-2.089*(LN(D8)-LN('Summary Sheet'!$C$5))+0.491*(E8^2-'Summary Sheet'!$C$4^2)+0.23*((E8*LN(D8)-'Summary Sheet'!$C$4*LN('Summary Sheet'!$C$5))))","v":45794.994802424},null,null,"-",null,null,"Physa",null,"Value is from 2007 FW Cu AWQC Appendix C recommendation","Raw Lake Superior water"]
[null,"Snail, Physa sp. ","S, M, T",47.4,8.17,1.1000000000000001,">",24700,"Call 1984; Call et al. 1984",">",{"$f":"EXP(LN(H9)-0.597*(LN(F9)-LN('Summary Sheet'!$C$6))-8.802*(E9-'Summary Sheet'!$C$4)-2.089*(LN(D9)-LN('Summary Sheet'!$C$5))+0.491*(E9^2-'Summary Sheet'!$C$4^2)+0.23*((E9*LN(D9)-'Summary Sheet'!$C$4*LN('Summary Sheet'!$C$5))))","v":32735.495086367009},"c",null,"-",null,null,"Physa",null,"Value is from 2007 FW Cu AWQC Appendix C recommendation","Raw Lake Superior water"]
[null,"Snail, Physa sp. ","S, M, T",47.4,7.46,1.1000000000000001,null,55500,"Call 1984; Call et al. 1984",null,{"$f":"EXP(LN(H10)-0.597*(LN(F10)-LN('Summary Sheet'!$C$6))-8.802*(E10-'Summary Sheet'!$C$4)-2.089*(LN(D10)-LN('Summary Sheet'!$C$5))+0.491*(E10^2-'Summary Sheet'!$C$4^2)+0.23*((E10*LN(D10)-'Summary Sheet'!$C$4*LN('Summary Sheet'!$C$5))))","v":87232.10441190195},null,null,{"$f":"GEOMEAN(K7:K8,K10)","v":70846.905401769967},{"$f":"N10","v":70846.905401769967},null,"Physa","Mollusk","Value is from 2007 FW Cu AWQC Appendix C recommendation","Raw Lake Superior water"]
[]
[null,"Snail, Melanoides tuberculata","R, M, T",18.72,6.68,3.2,null,68230,"Shuhaimi-Othman et al. 2012b, 2013",null,{"$f":"EXP(LN(H12)-0.597*(LN(F12)-LN('Summary Sheet'!$C$6))-8.802*(E12-'Summary Sheet'!$C$4)-2.089*(LN(D12)-LN('Summary Sheet'!$C$5))+0.491*(E12^2-'Summary Sheet'!$C$4^2)+0.23*((E12*LN(D12)-'Summary Sheet'!$C$4*LN('Summary Sheet'!$C$5))))","v":202135.99697737375},null,null,{"$f":"GEOMEAN(K12)","v":202135.99697737375},{"$f":"N12","v":202135.99697737375},null,"Melanoides","Mollusk","Value is from Shuhaimi-Othman et al. 2013","Tap water (Malaysia)"]
[]
[null,"Fatmucket, Lampsilis siliquoidea","R, M, T",107,8.19,0.5,">",54300,"Ivey et al. 2014",">",{"$f":"EXP(LN(H14)-0.597*(LN(F14)-LN('Summary Sheet'!$C$6))-8.802*(E14-'Summary Sheet'!$C$4)-2.089*(LN(D14)-LN('Summary Sheet'!$C$5))+0.491*(E14^2-'Summary Sheet'!$C$4^2)+0.23*((E14*LN(D14)-'Summary Sheet'!$C$4*LN('Summary Sheet'!$C$5))))","v":97719.217558108416},"f",null,"-",null,null,"Lampsilis",null,"Author reported","Well water/deionized water mix"]
[null,"Fatmucket, Lampsilis siliquoidea","F, M, T",106,6.12,0.48,">",6302,"Wang et al. 2016, 2018",">",{"$f":"EXP(LN(H15)-0.597*(LN(F15)-LN('Summary Sheet'!$C$6))-8.802*(E15-'Summary Sheet'!$C$4)-2.089*(LN(D15)-LN('Summary Sheet'!$C$5))+0.491*(E15^2-'Summary Sheet'!$C$4^2)+0.23*((E15*LN(D15)-'Summary Sheet'!$C$4*LN('Summary Sheet'!$C$5))))","v":49916.991084267444},null,">",{"$f":"GEOMEAN(K15)","v":49916.991084267444},{"$f":"N15","v":49916.991084267444},">","Lampsilis","Mollusk","Author reported","Well water/deionized water mix"]
{"$rows_left_out":136}
{"sheet":"Chronic Dataset","index":5,"n_rows":82,"n_cols":20,"rows_kept":82,"cut":false,"hidden":false,"merged":[]}
[null,"Appendix C. Acceptable Chronic Toxicity Data of Aluminum to Freshwater Aquatic Animals"]
[null,null,null,null,null,null,null,null,null,null,"Values in bold used in SMAV calculation"]
[null,"Species","Total Hardness (mg/L as CaCO3)","pH","DOC\n(mg/L)","EC20 Endpoint",null,"EC20\n(µg/L)","Reference",null,"Normalized Conc.- EC20\n(µg/L)","Reason excluded from SMCV",null,"SMCV-EC20\n(µg/L)","GMCV-EC20\n(µg/L)",null,"Genus",null,"DOC Notes","Dilution water"]
[]
[null,"Oligochaete, Aeolosoma sp.",48,5.95,0.25,"Reproduction (population size)",null,1235,"OSU 2012e; Cardwell et al. 2018",null,{"$f":"EXP(LN(H5)-0.597*(LN(E5)-LN('Summary Sheet'!$C$6))-8.802*(D5-'Summary Sheet'!$C$4)-2.089*(LN(C5)-LN('Summary Sheet'!$C$5))+0.491*(D5^2-'Summary Sheet'!$C$4^2)+0.23*(D5*LN(C5)-'Summary Sheet'!$C$4*LN('Summary Sheet'!$C$5)))","v":34720.40938168201},null,null,{"$f":"K5","v":34720.40938168201},{"$f":"N5","v":34720.40938168201},null,"Aeolosoma","Invert","Author reported; half the detection limit","Soft Lab Recon water"]
[]
[null,"Rotifer, Brachionus calyciflorus",100,6.45,0.25,"Reproduction (population size)",null,431,"OSU 2012c; Cardwell et al. 2018",null,{"$f":"EXP(LN(H7)-0.597*(LN(E7)-LN('Summary Sheet'!$C$6))-8.802*(D7-'Summary Sheet'!$C$4)-2.089*(LN(C7)-LN('Summary Sheet'!$C$5))+0.491*(D7^2-'Summary Sheet'!$C$4^2)+0.23*(D7*LN(C7)-'Summary Sheet'!$C$4*LN('Summary Sheet'!$C$5)))","v":3122.3293270569825},null,null,null,null,null,"Brachionus",null,"Author reported; half the detection limit","Mod Hard Lab Recon water"]
[null,"Rotifer, Brachionus calyciflorus",63,6.3,1.39,"Reproduction (population size)",null,1751,"OSU 2018e",null,{"$f":"EXP(LN(H8)-0.597*(LN(E8)-LN('Summary Sheet'!$C$6))-8.802*(D8-'Summary Sheet'!$C$4)-2.089*(LN(C8)-LN('Summary Sheet'!$C$5))+0.491*(D8^2-'Summary Sheet'!$C$4^2)+0.23*(D8*LN(C8)-'Summary Sheet'!$C$4*LN('Summary Sheet'!$C$5)))","v":7646.8079301684875},null,null,null,null,null,"Brachionus",null,"Author reported","Recon Lab water"]
[null,"Rotifer, Brachionus calyciflorus",105,6.3,1.39,"Reproduction (population size)",null,2066,"OSU 2018e",null,{"$f":"EXP(LN(H9)-0.597*(LN(E9)-LN('Summary Sheet'!$C$6))-8.802*(D9-'Summary Sheet'!$C$4)-2.089*(LN(C9)-LN('Summary Sheet'!$C$5))+0.491*(D9^2-'Summary Sheet'!$C$4^2)+0.23*(D9*LN(C9)-'Summary Sheet'!$C$4*LN('Summary Sheet'!$C$5)))","v":6506.4059015832954},null,null,null,null,null,"Brachionus",null,"Author reported","Recon Lab water"]
[null,"Rotifer, Brachionus calyciflorus",114,6.2,2.63,"Reproduction (population size)",null,3061,"OSU 2018e",null,{"$f":"EXP(LN(H10)-0.597*(LN(E10)-LN('Summary Sheet'!$C$6))-8.802*(D10-'Summary Sheet'!$C$4)-2.089*(LN(C10)-LN('Summary Sheet'!$C$5))+0.491*(D10^2-'Summary Sheet'!$C$4^2)+0.23*(D10*LN(C10)-'Summary Sheet'!$C$4*LN('Summary Sheet'!$C$5)))","v":7316.2985525484819},null,null,null,null,null,"Brachionus",null,"Author reported","Recon Lab water"]
[null,"Rotifer, Brachionus calyciflorus",105,6.1,3.77,"Reproduction (population size)",null,4670,"OSU 2018e",null,{"$f":"EXP(LN(H11)-0.597*(LN(E11)-LN('Summary Sheet'!$C$6))-8.802*(D11-'Summary Sheet'!$C$4)-2.089*(LN(C11)-LN('Summary Sheet'!$C$5))+0.491*(D11^2-'Summary Sheet'!$C$4^2)+0.23*(D11*LN(C11)-'Summary Sheet'!$C$4*LN('Summary Sheet'!$C$5)))","v":11260.491827835447},null,null,null,null,null,"Brachionus",null,"Author reported","Recon Lab water"]
[null,"Rotifer, Brachionus calyciflorus",185,6.3,1.33,"Reproduction (population size)",null,1604,"OSU 2018e",null,{"$f":"EXP(LN(H12)-0.597*(LN(E12)-LN('Summary Sheet'!$C$6))-8.802*(D12-'Summary Sheet'!$C$4)-2.089*(LN(C12)-LN('Summary Sheet'!$C$5))+0.491*(D12^2-'Summary Sheet'!$C$4^2)+0.23*(D12*LN(C12)-'Summary Sheet'!$C$4*LN('Summary Sheet'!$C$5)))","v":3609.3321608671181},null,null,{"$f":"GEOMEAN(K7:K12)","v":5990.0338819298604},{"$f":"N12","v":5990.0338819298604},null,"Brachionus","Invert","Author reported","Recon Lab water"]
[]
[null,"Great pond snail, Lymnaea stagnalis",117,6,0.25,"Biomass",null,745.7,"OSU 2012b; Cardwell et al. 2018",null,{"$f":"EXP(LN(H14)-0.597*(LN(E14)-LN('Summary Sheet'!$C$6))-8.802*(D14-'Summary Sheet'!$C$4)-2.089*(LN(C14)-LN('Summary Sheet'!$C$5))+0.491*(D14^2-'Summary Sheet'!$C$4^2)+0.23*(D14*LN(C14)-'Summary Sheet'!$C$4*LN('Summary Sheet'!$C$5)))","v":10063.513062994862},null,null,null,null,null,"Lymnaea",null,"Author reported; half the detection limit","Recon Lab water (between mod hard and hard)"]
[null,"Great pond snail, Lymnaea stagnalis",121,6.15,1.37,"Biomass",null,833.42,"OSU 2018f",null,{"$f":"EXP(LN(H15)-0.597*(LN(E15)-LN('Summary Sheet'!$C$6))-8.802*(D15-'Summary Sheet'!$C$4)-2.089*(LN(C15)-LN('Summary Sheet'!$C$5))+0.491*(D15^2-'Summary Sheet'!$C$4^2)+0.23*(D15*LN(C15)-'Summary Sheet'!$C$4*LN('Summary Sheet'!$C$5)))","v":3067.1199936222179},null,null,null,null,null,"Lymnaea",null,"Author reported","Recon Lab water"]
{"$rows_left_out":67}