{"text_format":"1","workbook":"xlsx","n_sheets":6,"sheets":["Read Me","Multiple Scenarios","Over 20 Scenarios","Summary Sheet","Acute Dataset","Chronic Dataset"],"not_rendered":{"charts":0,"images":6,"macros":1,"external_links":0,"defined_names":0,"comments":0,"pivot_tables":0},"unopened":[],"bounds":{"document_bytes":16777216,"sheet_cells":100000,"rows_first":2000,"rows_last":500,"rows_between":2000,"halvings":0,"cell_chars":16384,"cell_head_chars":4096},"cells_cut":0,"cells_raw":0,"read":"whole","date_system":"1900"}

{"sheet":"Read Me","index":0,"n_rows":124,"n_cols":1,"rows_kept":124,"cut":false,"hidden":false,"merged":[[103,0,103,23],[107,0,107,23],[123,0,123,23],[3,0,3,23],[6,0,6,23],[17,0,17,23],[27,0,27,23],[47,0,47,23],[67,0,67,23]]}
["Guidance for use of the Aluminun Criteria Calculator V.2.0.Macro"]
[]
["Introduction"]
["To faciliate adoption of the 2018 aluminum criteria, EPA developed a macro-enabled Excel file that allows users to caclulate multiple criteria values for various water chemistry scenarios. The draft aluminum criteria are dependent on the hardness, pH and dissolved organic carbon (DOC) of the site water. The Excel file also provides the acute and chronic datasets used to calculate the values, the formulas used to normalize the data, and the assumptions made on missing water chemistry parameters for added transparency. This guidance document outlines how users can calculate criteria values for aluminum using this Excel file. Additionaly acute and chronic criteria values for various scenarios are also provided in Appendix K of the aluminum ambient water quality criteria document."]
[]
["Getting Started – Initial Steps"]
["Download the Excel file from the docket or aluminum criteria website and save on your hard drive. Depending on the security settings on your computer you will need to hit one or both of the, “Enable Editing” and “Enable Content” buttons before use (see figure below)."]
[]
[]
[]
[]
[]
[]
[]
[]
[]
[]
["The Excel File consists of six sheets: Read Me, Multiple Scenarios, Over 20 Scenarios, Summary Sheet, Acute Dataset and Chronic Dataset. Only two of these sheets can be edited by the user to enter water chemistry parameters: Multiple Scenarios and Over 20 Scenarios. The other sheets are provided for transparency to see how values (i.e., Genus Mean Acute Values (GMAVs), Genus Mean Chronic Values (GMCVs)) are calculated and how the data are used to construct the sensitivity distribution (SD)."]
[]
[]
[]
[]
[]
[]
[]
[]
["Acute Dataset"]
["This sheet contains all the freshwater acute data used to construct the SD for the aluminum freshwater acute criterion (the Criterion Maximum Concentration or CMC). This spreadsheet has been locked for editing and cannot be manipulated. However, all of the calculations, normalization equations and water chemistry data are still available to be viewed. The values in columns K [Normalized Conc. - LC50 (µg/L)], N [Species Mean Acute Value (µg/L)], and O [Genus Mean Acute Value (µg/L)] are all based on the user supplied water chemistry values."]
[]
[]
[]
[]
[]
[]
[]
[]
[]
[]
[]
[]
[]
[]
[]
[]
[]
[]
["Chronic Dataset"]
["This sheet contains all the freshwater chronic data used to construct the SD for the freshwater aluminum chronic criterion (the Criterion Continuous Concentration or CCC). This spreadsheet has also been locked for editing and cannot be manipulated. However, all of the calculations, normalization equations and water chemistry data are still available to be viewed. The values in columns K [Normalized Conc. - EC20 (µg/L)], N [SMCV-EC20 (µg/L)], and O [GMCV-EC20 (µg/L)] are all based on the user supplied chemistry values in the Summary Sheet (see figure below)."]
[]
[]
[]
[]
[]
[]
[]
[]
[]
[]
[]
[]
[]
[]
[]
[]
[]
[]
["Summary Sheet"]
["This spreadsheet is used to generate all of the criteria values for all of the water chemistry scenarios. Three cells (C4, C5, and C6) are the water chemistry inputs used to generate criteria values, SMAVs, SMCVs, GMAVs, and GMCVs. These cells are highlighted so the user can know what SD is displayed. The value for these cells will come from the \"Multiple Scenarios\" tab or the \"Over 20 Scenarios\" tab and will be the last entry Row 29 or Row 509, respectively after the Macro-enable button is clicked."]
[]
[]
[]
[]
[]
[]
[]
[]
[]
[]
[]
[]
[]
[]
[]
[]
[]
[]
[]
[]
[]
[]
[]
[]
[]
[]
[]
[]
[]
[]
[]
[]
[]
[]
[]
["EPA aluminum criteria recommend staying within specific limits for pH (5.0-10.5), total hardness (0.01-430 mg/L as CaCO3) and DOC (0.08-12.0 mg/L) for generating criteria. When water chemistry conditions outside these recommendations are encountered, the Macro-enable buttons will edit values to the maximum and/or minimum recommended value. Additionally it will flag values that are \"outside model inputs\"; for more information please refer to the aluminum criteria document. As more data become available, these recommendations may change. The summary sheet also provides the SDs for the acute and chronic datasets, the criteria calculations and the Final Acute Value (FAV), CMC and CCC based on the values in C4 (pH), C5 (hardness) and C6 (DOC). The CMC and CCC values in bold (H5 and H6) are rounded to two significant figures."]
[]
[]
["Multiple Scenarios and Over 20 Scenarios"]
["These sheets have a macro-enabled buttons, “Run Scenarios” that will run the calculations for 20 or 500 different water chemistry inputs to provide a quick way to calculate multiple criteria values. Users first enter water chemistry conditions of interest in the highlighted cells in columns B, C, D, and E, then click the “Run Scenarios” button. The spreadsheet will run the necessary calculations and populate all of the other cells (please note that this step could take a few minutes depending on the computing speed of your computer). The macro-enable button uses the Summary Sheet to generate the values, so that the last entry will now be displayed there."]
[]
[]
[]
[]
[]
[]
[]
[]
[]
[]
[]
[]
[]
[]
[]
["Again, for each set of conditions, the Excel file will default to the recommended maximum/minimum values when the pH, DOC or hardness values of interest are beyond the specified limits. This sheet will also display the lowest four ranked genera, their GMAV/GMCV, the FAV, CMC and CCC for each set of conditions. Again the CMC and CCC are rounded to two significant figures. To calculate more scenarios, just enter new values into columns B, C, D, and E, and hit the “Run Scenarios” button again. There is no need to save the file when closing."]

{"sheet":"Multiple Scenarios","index":1,"n_rows":29,"n_cols":35,"rows_kept":29,"cut":false,"hidden":false,"merged":[[8,24,8,25],[8,27,8,28],[8,30,8,31],[8,33,8,34],[8,11,8,12],[8,14,8,15],[8,17,8,18],[8,20,8,21],[7,10,7,12],[7,13,7,15],[7,19,7,21],[6,1,6,4],[6,10,6,21],[7,16,7,18],[6,23,6,34],[7,23,7,25],[7,26,7,28],[7,29,7,31],[7,32,7,34]]}
[null,null,null,null,"All concentrations reported are µg/L total Aluminum"]
[]
[null,null,null,null,"<-----Click Button after entering data"]
[]
[]
[]
[null,"ENTER DATA HERE",null,null,null,null,null,null,null,null,"ACUTE",null,null,null,null,null,null,null,null,null,null,null,null,"CHRONIC"]
[null,null,null,null,null,null,null,null,null,null,"Rank 1",null,null,"Rank 2",null,null,"Rank 3",null,null,"Rank 4",null,null,null,"Rank 1",null,null,"Rank 2",null,null,"Rank 3",null,null,"Rank 4"]
[null,"SiteName","DOC\n(mg/L)","Total Hardness\n(mg/L as CaCO3)","pH",null,"FAV","CMC","CCC","Flag","Genus","GMAV",null,"Genus","GMAV",null,"Genus","GMAV",null,"Genus","GMAV",null,null,"Genus","GMCV",null,"Genus","GMCV",null,"Genus","GMCV",null,"Genus","GMCV"]
[null,"Site 1",1,25,7,7542.8737034161522,1235.0854885898855,620,300,{"$f":"IF(OR(C10>12,D10>430,E10<6,E10>8.2),\"Outside model inputs\",\" \")","v":" "},"Daphnia","",1196.7565860179077,"Micropterus","",2148.0125447848536,"Oncorhynchus","",2381.2821602543904,"Ceriodaphnia","",4000.0101878769487,null,"Salmo","",312.32701795429676,"Salvelinus","",458.82852674817599,"Daphnia","",507.18177535950741,"Lampsilis","",528.21056950795241]
[null,"Site 2",1,50,7,7542.8737034161522,1572.911407679268,790,340,{"$f":"IF(OR(C11>12,D11>430,E11<6,E11>8.2),\"Outside model inputs\",\" \")","v":" "},"Daphnia","",1668.0120898410823,"Micropterus","",2533.2727549518104,"Oncorhynchus","",2808.3808137300452,"Ceriodaphnia","",5575.1231543808863,null,"Salmo","",368.34492756568761,"Salvelinus","",541.12244773796294,"Daphnia","",706.89841437318262,"Lampsilis","",736.2078690143295]
[null,"Site 3",1,100,7,7542.8737034161522,1960.7253936241273,980,380," ","Daphnia","",2324.837284676019,"Micropterus","",2987.6319235481492,"Oncorhynchus","",3312.0824262524493,"Ceriodaphnia","",7770.4797554555653,null,"Salmo","",434.41001855057362,"Salvelinus","",638.17632596029205,"Daphnia","",985.25892001760678,"Lampsilis","",1026.1097707747783]
[null,"Site 4",1,150,7,7542.8737034161522,2210.7541738487143,1100,400," ","Daphnia","",2823.1910925627026,"Micropterus","",3290.3099515003423,"Oncorhynchus","",3647.6306473340542,"Ceriodaphnia","",9436.1654362395857,null,"Salmo","",478.42024842568037,"Salvelinus","",702.83019121891255,"Daphnia","",1196.4597372883579,"Lampsilis","",1246.067406066491]
[null,"Site 5",1,100,7,7542.8737034161522,1960.7253936241273,980,380," ","Daphnia","",2324.837284676019,"Micropterus","",2987.6319235481492,"Oncorhynchus","",3312.0824262524493,"Ceriodaphnia","",7770.4797554555653,null,"Salmo","",434.41001855057362,"Salvelinus","",638.17632596029205,"Daphnia","",985.25892001760678,"Lampsilis","",1026.1097707747783]
[null,"Site 6",1,100,7,7542.8737034161522,1960.7253936241273,980,380," ","Daphnia","",2324.837284676019,"Micropterus","",2987.6319235481492,"Oncorhynchus","",3312.0824262524493,"Ceriodaphnia","",7770.4797554555653,null,"Salmo","",434.41001855057362,"Salvelinus","",638.17632596029205,"Daphnia","",985.25892001760678,"Lampsilis","",1026.1097707747783]
[null,"Site 7",1,100,7,7542.8737034161522,1960.7253936241273,980,380," ","Daphnia","",2324.837284676019,"Micropterus","",2987.6319235481492,"Oncorhynchus","",3312.0824262524493,"Ceriodaphnia","",7770.4797554555653,null,"Salmo","",434.41001855057362,"Salvelinus","",638.17632596029205,"Daphnia","",985.25892001760678,"Lampsilis","",1026.1097707747783]
[null,"Site 8",1,100,7,7542.8737034161522,1960.7253936241273,980,380," ","Daphnia","",2324.837284676019,"Micropterus","",2987.6319235481492,"Oncorhynchus","",3312.0824262524493,"Ceriodaphnia","",7770.4797554555653,null,"Salmo","",434.41001855057362,"Salvelinus","",638.17632596029205,"Daphnia","",985.25892001760678,"Lampsilis","",1026.1097707747783]
[null,"Site 9",1,100,7,7542.8737034161522,1960.7253936241273,980,380," ","Daphnia","",2324.837284676019,"Micropterus","",2987.6319235481492,"Oncorhynchus","",3312.0824262524493,"Ceriodaphnia","",7770.4797554555653,null,"Salmo","",434.41001855057362,"Salvelinus","",638.17632596029205,"Daphnia","",985.25892001760678,"Lampsilis","",1026.1097707747783]
[null,"Site 10",1,100,7,7542.8737034161522,1960.7253936241273,980,380," ","Daphnia","",2324.837284676019,"Micropterus","",2987.6319235481492,"Oncorhynchus","",3312.0824262524493,"Ceriodaphnia","",7770.4797554555653,null,"Salmo","",434.41001855057362,"Salvelinus","",638.17632596029205,"Daphnia","",985.25892001760678,"Lampsilis","",1026.1097707747783]
[null,"Site 11",1,100,7,7542.8737034161522,1960.7253936241273,980,380," ","Daphnia","",2324.837284676019,"Micropterus","",2987.6319235481492,"Oncorhynchus","",3312.0824262524493,"Ceriodaphnia","",7770.4797554555653,null,"Salmo","",434.41001855057362,"Salvelinus","",638.17632596029205,"Daphnia","",985.25892001760678,"Lampsilis","",1026.1097707747783]
[null,"Site 12",1,100,7,7542.8737034161522,1960.7253936241273,980,380," ","Daphnia","",2324.837284676019,"Micropterus","",2987.6319235481492,"Oncorhynchus","",3312.0824262524493,"Ceriodaphnia","",7770.4797554555653,null,"Salmo","",434.41001855057362,"Salvelinus","",638.17632596029205,"Daphnia","",985.25892001760678,"Lampsilis","",1026.1097707747783]
[null,"Site 13",1,100,7,7542.8737034161522,1960.7253936241273,980,380," ","Daphnia","",2324.837284676019,"Micropterus","",2987.6319235481492,"Oncorhynchus","",3312.0824262524493,"Ceriodaphnia","",7770.4797554555653,null,"Salmo","",434.41001855057362,"Salvelinus","",638.17632596029205,"Daphnia","",985.25892001760678,"Lampsilis","",1026.1097707747783]
[null,"Site 14",1,100,7,7542.8737034161522,1960.7253936241273,980,380," ","Daphnia","",2324.837284676019,"Micropterus","",2987.6319235481492,"Oncorhynchus","",3312.0824262524493,"Ceriodaphnia","",7770.4797554555653,null,"Salmo","",434.41001855057362,"Salvelinus","",638.17632596029205,"Daphnia","",985.25892001760678,"Lampsilis","",1026.1097707747783]
[null,"Site 15",1,100,7,7542.8737034161522,1960.7253936241273,980,380," ","Daphnia","",2324.837284676019,"Micropterus","",2987.6319235481492,"Oncorhynchus","",3312.0824262524493,"Ceriodaphnia","",7770.4797554555653,null,"Salmo","",434.41001855057362,"Salvelinus","",638.17632596029205,"Daphnia","",985.25892001760678,"Lampsilis","",1026.1097707747783]
[null,"Site 16",1,100,7,7542.8737034161522,1960.7253936241273,980,380," ","Daphnia","",2324.837284676019,"Micropterus","",2987.6319235481492,"Oncorhynchus","",3312.0824262524493,"Ceriodaphnia","",7770.4797554555653,null,"Salmo","",434.41001855057362,"Salvelinus","",638.17632596029205,"Daphnia","",985.25892001760678,"Lampsilis","",1026.1097707747783]
[null,"Site 17",1,100,7,7542.8737034161522,1960.7253936241273,980,380," ","Daphnia","",2324.837284676019,"Micropterus","",2987.6319235481492,"Oncorhynchus","",3312.0824262524493,"Ceriodaphnia","",7770.4797554555653,null,"Salmo","",434.41001855057362,"Salvelinus","",638.17632596029205,"Daphnia","",985.25892001760678,"Lampsilis","",1026.1097707747783]
[null,"Site 18",1,100,7,7542.8737034161522,1960.7253936241273,980,380," ","Daphnia","",2324.837284676019,"Micropterus","",2987.6319235481492,"Oncorhynchus","",3312.0824262524493,"Ceriodaphnia","",7770.4797554555653,null,"Salmo","",434.41001855057362,"Salvelinus","",638.17632596029205,"Daphnia","",985.25892001760678,"Lampsilis","",1026.1097707747783]
[null,"Site 19",1,100,7,7542.8737034161522,1960.7253936241273,980,380," ","Daphnia","",2324.837284676019,"Micropterus","",2987.6319235481492,"Oncorhynchus","",3312.0824262524493,"Ceriodaphnia","",7770.4797554555653,null,"Salmo","",434.41001855057362,"Salvelinus","",638.17632596029205,"Daphnia","",985.25892001760678,"Lampsilis","",1026.1097707747783]
[null,"Site 20",1,200,7,7542.8737034161522,2448.7522948964493,1200,420," ","Daphnia","",3240.3052910334127,"Micropterus","",3523.4834042865659,"Oncorhynchus","",3906.1262435133449,"Salmo","",10191.617351323644,null,"Salmo","",512.32431912193545,"Salvelinus","",752.63745704631208,"Daphnia","",1373.2314569343346,"Lampsilis","",1430.1684429007014]

{"sheet":"Over 20 Scenarios","index":2,"n_rows":509,"n_cols":35,"rows_kept":509,"cut":false,"hidden":false,"merged":[[8,27,8,28],[8,30,8,31],[8,33,8,34],[8,11,8,12],[8,14,8,15],[8,17,8,18],[8,20,8,21],[8,24,8,25],[6,1,6,4],[6,10,6,21],[6,23,6,34],[7,10,7,12],[7,13,7,15],[7,16,7,18],[7,19,7,21],[7,23,7,25],[7,26,7,28],[7,29,7,31],[7,32,7,34]]}
[null,null,null,null,"All concentrations reported are µg/L total Aluminum"]
[]
[null,null,null,null,"<-----Click Button after entering data"]
[]
[]
[]
[null,"ENTER DATA HERE",null,null,null,null,null,null,null,null,"ACUTE",null,null,null,null,null,null,null,null,null,null,null,null,"CHRONIC"]
[null,null,null,null,null,null,null,null,null,null,"Rank 1",null,null,"Rank 2",null,null,"Rank 3",null,null,"Rank 4",null,null,null,"Rank 1",null,null,"Rank 2",null,null,"Rank 3",null,null,"Rank 4"]
[null,"SiteName","DOC\n(mg/L)","Total Hardness\n(mg/L as CaCO3)","pH",null,"FAV","CMC","CCC","Flag","Genus","GMAV",null,"Genus","GMAV",null,"Genus","GMAV",null,"Genus","GMAV",null,null,"Genus","GMCV",null,"Genus","GMCV",null,"Genus","GMCV",null,"Genus","GMCV"]
[null,"Site 1",1,100,7,7542.8737034161522,1960.7253936241273,980,380,{"$f":"IF(OR(C10>12,D10>430,E10<6,E10>8.2),\"Outside model inputs\",\" \")","v":" "},"Daphnia","",2324.837284676019,"Micropterus","",2987.6319235481492,"Oncorhynchus","",3312.0824262524493,"Ceriodaphnia","",7770.4797554555653,null,"Salmo","",434.41001855057362,"Salvelinus","",638.17632596029205,"Daphnia","",985.25892001760678,"Lampsilis","",1026.1097707747783]
[null,"Site 2",1,100,7,7542.8737034161522,1960.7253936241273,980,380,{"$f":"IF(OR(C11>12,D11>430,E11<6,E11>8.2),\"Outside model inputs\",\" \")","v":" "},"Daphnia","",2324.837284676019,"Micropterus","",2987.6319235481492,"Oncorhynchus","",3312.0824262524493,"Ceriodaphnia","",7770.4797554555653,null,"Salmo","",434.41001855057362,"Salvelinus","",638.17632596029205,"Daphnia","",985.25892001760678,"Lampsilis","",1026.1097707747783]
[null,"Site 3",1,100,7,7542.8737034161522,1960.7253936241273,980,380," ","Daphnia","",2324.837284676019,"Micropterus","",2987.6319235481492,"Oncorhynchus","",3312.0824262524493,"Ceriodaphnia","",7770.4797554555653,null,"Salmo","",434.41001855057362,"Salvelinus","",638.17632596029205,"Daphnia","",985.25892001760678,"Lampsilis","",1026.1097707747783]
[null,"Site 4",1,100,7,7542.8737034161522,1960.7253936241273,980,380," ","Daphnia","",2324.837284676019,"Micropterus","",2987.6319235481492,"Oncorhynchus","",3312.0824262524493,"Ceriodaphnia","",7770.4797554555653,null,"Salmo","",434.41001855057362,"Salvelinus","",638.17632596029205,"Daphnia","",985.25892001760678,"Lampsilis","",1026.1097707747783]
[null,"Site 5",1,100,7,7542.8737034161522,1960.7253936241273,980,380," ","Daphnia","",2324.837284676019,"Micropterus","",2987.6319235481492,"Oncorhynchus","",3312.0824262524493,"Ceriodaphnia","",7770.4797554555653,null,"Salmo","",434.41001855057362,"Salvelinus","",638.17632596029205,"Daphnia","",985.25892001760678,"Lampsilis","",1026.1097707747783]
[null,"Site 6",1,100,7,7542.8737034161522,1960.7253936241273,980,380," ","Daphnia","",2324.837284676019,"Micropterus","",2987.6319235481492,"Oncorhynchus","",3312.0824262524493,"Ceriodaphnia","",7770.4797554555653,null,"Salmo","",434.41001855057362,"Salvelinus","",638.17632596029205,"Daphnia","",985.25892001760678,"Lampsilis","",1026.1097707747783]
[null,"Site 7",1,100,7,7542.8737034161522,1960.7253936241273,980,380," ","Daphnia","",2324.837284676019,"Micropterus","",2987.6319235481492,"Oncorhynchus","",3312.0824262524493,"Ceriodaphnia","",7770.4797554555653,null,"Salmo","",434.41001855057362,"Salvelinus","",638.17632596029205,"Daphnia","",985.25892001760678,"Lampsilis","",1026.1097707747783]
[null,"Site 8",1,100,7,7542.8737034161522,1960.7253936241273,980,380," ","Daphnia","",2324.837284676019,"Micropterus","",2987.6319235481492,"Oncorhynchus","",3312.0824262524493,"Ceriodaphnia","",7770.4797554555653,null,"Salmo","",434.41001855057362,"Salvelinus","",638.17632596029205,"Daphnia","",985.25892001760678,"Lampsilis","",1026.1097707747783]
[null,"Site 9",1,100,7,7542.8737034161522,1960.7253936241273,980,380," ","Daphnia","",2324.837284676019,"Micropterus","",2987.6319235481492,"Oncorhynchus","",3312.0824262524493,"Ceriodaphnia","",7770.4797554555653,null,"Salmo","",434.41001855057362,"Salvelinus","",638.17632596029205,"Daphnia","",985.25892001760678,"Lampsilis","",1026.1097707747783]
[null,"Site 10",1,100,7,7542.8737034161522,1960.7253936241273,980,380," ","Daphnia","",2324.837284676019,"Micropterus","",2987.6319235481492,"Oncorhynchus","",3312.0824262524493,"Ceriodaphnia","",7770.4797554555653,null,"Salmo","",434.41001855057362,"Salvelinus","",638.17632596029205,"Daphnia","",985.25892001760678,"Lampsilis","",1026.1097707747783]
[null,"Site 11",1,100,7,7542.8737034161522,1960.7253936241273,980,380," ","Daphnia","",2324.837284676019,"Micropterus","",2987.6319235481492,"Oncorhynchus","",3312.0824262524493,"Ceriodaphnia","",7770.4797554555653,null,"Salmo","",434.41001855057362,"Salvelinus","",638.17632596029205,"Daphnia","",985.25892001760678,"Lampsilis","",1026.1097707747783]
[null,"Site 12",1,100,7,7542.8737034161522,1960.7253936241273,980,380," ","Daphnia","",2324.837284676019,"Micropterus","",2987.6319235481492,"Oncorhynchus","",3312.0824262524493,"Ceriodaphnia","",7770.4797554555653,null,"Salmo","",434.41001855057362,"Salvelinus","",638.17632596029205,"Daphnia","",985.25892001760678,"Lampsilis","",1026.1097707747783]
[null,"Site 13",1,100,7,7542.8737034161522,1960.7253936241273,980,380," ","Daphnia","",2324.837284676019,"Micropterus","",2987.6319235481492,"Oncorhynchus","",3312.0824262524493,"Ceriodaphnia","",7770.4797554555653,null,"Salmo","",434.41001855057362,"Salvelinus","",638.17632596029205,"Daphnia","",985.25892001760678,"Lampsilis","",1026.1097707747783]
[null,"Site 14",1,100,7,7542.8737034161522,1960.7253936241273,980,380," ","Daphnia","",2324.837284676019,"Micropterus","",2987.6319235481492,"Oncorhynchus","",3312.0824262524493,"Ceriodaphnia","",7770.4797554555653,null,"Salmo","",434.41001855057362,"Salvelinus","",638.17632596029205,"Daphnia","",985.25892001760678,"Lampsilis","",1026.1097707747783]
[null,"Site 15",1,100,7,7542.8737034161522,1960.7253936241273,980,380," ","Daphnia","",2324.837284676019,"Micropterus","",2987.6319235481492,"Oncorhynchus","",3312.0824262524493,"Ceriodaphnia","",7770.4797554555653,null,"Salmo","",434.41001855057362,"Salvelinus","",638.17632596029205,"Daphnia","",985.25892001760678,"Lampsilis","",1026.1097707747783]
[null,"Site 16",1,100,7,7542.8737034161522,1960.7253936241273,980,380," ","Daphnia","",2324.837284676019,"Micropterus","",2987.6319235481492,"Oncorhynchus","",3312.0824262524493,"Ceriodaphnia","",7770.4797554555653,null,"Salmo","",434.41001855057362,"Salvelinus","",638.17632596029205,"Daphnia","",985.25892001760678,"Lampsilis","",1026.1097707747783]
[null,"Site 17",1,100,7,7542.8737034161522,1960.7253936241273,980,380," ","Daphnia","",2324.837284676019,"Micropterus","",2987.6319235481492,"Oncorhynchus","",3312.0824262524493,"Ceriodaphnia","",7770.4797554555653,null,"Salmo","",434.41001855057362,"Salvelinus","",638.17632596029205,"Daphnia","",985.25892001760678,"Lampsilis","",1026.1097707747783]
[null,"Site 18",1,100,7,7542.8737034161522,1960.7253936241273,980,380," ","Daphnia","",2324.837284676019,"Micropterus","",2987.6319235481492,"Oncorhynchus","",3312.0824262524493,"Ceriodaphnia","",7770.4797554555653,null,"Salmo","",434.41001855057362,"Salvelinus","",638.17632596029205,"Daphnia","",985.25892001760678,"Lampsilis","",1026.1097707747783]
[null,"Site 19",1,100,7,7542.8737034161522,1960.7253936241273,980,380," ","Daphnia","",2324.837284676019,"Micropterus","",2987.6319235481492,"Oncorhynchus","",3312.0824262524493,"Ceriodaphnia","",7770.4797554555653,null,"Salmo","",434.41001855057362,"Salvelinus","",638.17632596029205,"Daphnia","",985.25892001760678,"Lampsilis","",1026.1097707747783]
[null,"Site 20",1,100,7,7542.8737034161522,1960.7253936241273,980,380," ","Daphnia","",2324.837284676019,"Micropterus","",2987.6319235481492,"Oncorhynchus","",3312.0824262524493,"Ceriodaphnia","",7770.4797554555653,null,"Salmo","",434.41001855057362,"Salvelinus","",638.17632596029205,"Daphnia","",985.25892001760678,"Lampsilis","",1026.1097707747783]
[null,"Site 21",1,100,7,7542.8737034161522,1960.7253936241273,980,380," ","Daphnia","",2324.837284676019,"Micropterus","",2987.6319235481492,"Oncorhynchus","",3312.0824262524493,"Ceriodaphnia","",7770.4797554555653,null,"Salmo","",434.41001855057362,"Salvelinus","",638.17632596029205,"Daphnia","",985.25892001760678,"Lampsilis","",1026.1097707747783]
[null,"Site 22",1,100,7,7542.8737034161522,1960.7253936241273,980,380," ","Daphnia","",2324.837284676019,"Micropterus","",2987.6319235481492,"Oncorhynchus","",3312.0824262524493,"Ceriodaphnia","",7770.4797554555653,null,"Salmo","",434.41001855057362,"Salvelinus","",638.17632596029205,"Daphnia","",985.25892001760678,"Lampsilis","",1026.1097707747783]
[null,"Site 23",1,100,7,7542.8737034161522,1960.7253936241273,980,380," ","Daphnia","",2324.837284676019,"Micropterus","",2987.6319235481492,"Oncorhynchus","",3312.0824262524493,"Ceriodaphnia","",7770.4797554555653,null,"Salmo","",434.41001855057362,"Salvelinus","",638.17632596029205,"Daphnia","",985.25892001760678,"Lampsilis","",1026.1097707747783]
[null,"Site 24",1,100,7,7542.8737034161522,1960.7253936241273,980,380," ","Daphnia","",2324.837284676019,"Micropterus","",2987.6319235481492,"Oncorhynchus","",3312.0824262524493,"Ceriodaphnia","",7770.4797554555653,null,"Salmo","",434.41001855057362,"Salvelinus","",638.17632596029205,"Daphnia","",985.25892001760678,"Lampsilis","",1026.1097707747783]
[null,"Site 25",1,100,7,7542.8737034161522,1960.7253936241273,980,380," ","Daphnia","",2324.837284676019,"Micropterus","",2987.6319235481492,"Oncorhynchus","",3312.0824262524493,"Ceriodaphnia","",7770.4797554555653,null,"Salmo","",434.41001855057362,"Salvelinus","",638.17632596029205,"Daphnia","",985.25892001760678,"Lampsilis","",1026.1097707747783]
[null,"Site 26",1,100,7,7542.8737034161522,1960.7253936241273,980,380," ","Daphnia","",2324.837284676019,"Micropterus","",2987.6319235481492,"Oncorhynchus","",3312.0824262524493,"Ceriodaphnia","",7770.4797554555653,null,"Salmo","",434.41001855057362,"Salvelinus","",638.17632596029205,"Daphnia","",985.25892001760678,"Lampsilis","",1026.1097707747783]
[null,"Site 27",1,100,7,7542.8737034161522,1960.7253936241273,980,380," ","Daphnia","",2324.837284676019,"Micropterus","",2987.6319235481492,"Oncorhynchus","",3312.0824262524493,"Ceriodaphnia","",7770.4797554555653,null,"Salmo","",434.41001855057362,"Salvelinus","",638.17632596029205,"Daphnia","",985.25892001760678,"Lampsilis","",1026.1097707747783]
[null,"Site 28",1,100,7,7542.8737034161522,1960.7253936241273,980,380," ","Daphnia","",2324.837284676019,"Micropterus","",2987.6319235481492,"Oncorhynchus","",3312.0824262524493,"Ceriodaphnia","",7770.4797554555653,null,"Salmo","",434.41001855057362,"Salvelinus","",638.17632596029205,"Daphnia","",985.25892001760678,"Lampsilis","",1026.1097707747783]
[null,"Site 29",1,100,7,7542.8737034161522,1960.7253936241273,980,380," ","Daphnia","",2324.837284676019,"Micropterus","",2987.6319235481492,"Oncorhynchus","",3312.0824262524493,"Ceriodaphnia","",7770.4797554555653,null,"Salmo","",434.41001855057362,"Salvelinus","",638.17632596029205,"Daphnia","",985.25892001760678,"Lampsilis","",1026.1097707747783]
[null,"Site 30",1,100,7,7542.8737034161522,1960.7253936241273,980,380," ","Daphnia","",2324.837284676019,"Micropterus","",2987.6319235481492,"Oncorhynchus","",3312.0824262524493,"Ceriodaphnia","",7770.4797554555653,null,"Salmo","",434.41001855057362,"Salvelinus","",638.17632596029205,"Daphnia","",985.25892001760678,"Lampsilis","",1026.1097707747783]
[null,"Site 31",1,100,7,7542.8737034161522,1960.7253936241273,980,380," ","Daphnia","",2324.837284676019,"Micropterus","",2987.6319235481492,"Oncorhynchus","",3312.0824262524493,"Ceriodaphnia","",7770.4797554555653,null,"Salmo","",434.41001855057362,"Salvelinus","",638.17632596029205,"Daphnia","",985.25892001760678,"Lampsilis","",1026.1097707747783]
[null,"Site 32",1,100,7,7542.8737034161522,1960.7253936241273,980,380," ","Daphnia","",2324.837284676019,"Micropterus","",2987.6319235481492,"Oncorhynchus","",3312.0824262524493,"Ceriodaphnia","",7770.4797554555653,null,"Salmo","",434.41001855057362,"Salvelinus","",638.17632596029205,"Daphnia","",985.25892001760678,"Lampsilis","",1026.1097707747783]
[null,"Site 33",1,100,7,7542.8737034161522,1960.7253936241273,980,380," ","Daphnia","",2324.837284676019,"Micropterus","",2987.6319235481492,"Oncorhynchus","",3312.0824262524493,"Ceriodaphnia","",7770.4797554555653,null,"Salmo","",434.41001855057362,"Salvelinus","",638.17632596029205,"Daphnia","",985.25892001760678,"Lampsilis","",1026.1097707747783]
[null,"Site 34",1,100,7,7542.8737034161522,1960.7253936241273,980,380," ","Daphnia","",2324.837284676019,"Micropterus","",2987.6319235481492,"Oncorhynchus","",3312.0824262524493,"Ceriodaphnia","",7770.4797554555653,null,"Salmo","",434.41001855057362,"Salvelinus","",638.17632596029205,"Daphnia","",985.25892001760678,"Lampsilis","",1026.1097707747783]
[null,"Site 35",1,100,7,7542.8737034161522,1960.7253936241273,980,380," ","Daphnia","",2324.837284676019,"Micropterus","",2987.6319235481492,"Oncorhynchus","",3312.0824262524493,"Ceriodaphnia","",7770.4797554555653,null,"Salmo","",434.41001855057362,"Salvelinus","",638.17632596029205,"Daphnia","",985.25892001760678,"Lampsilis","",1026.1097707747783]
[null,"Site 36",1,100,7,7542.8737034161522,1960.7253936241273,980,380," ","Daphnia","",2324.837284676019,"Micropterus","",2987.6319235481492,"Oncorhynchus","",3312.0824262524493,"Ceriodaphnia","",7770.4797554555653,null,"Salmo","",434.41001855057362,"Salvelinus","",638.17632596029205,"Daphnia","",985.25892001760678,"Lampsilis","",1026.1097707747783]
[null,"Site 37",1,100,7,7542.8737034161522,1960.7253936241273,980,380," ","Daphnia","",2324.837284676019,"Micropterus","",2987.6319235481492,"Oncorhynchus","",3312.0824262524493,"Ceriodaphnia","",7770.4797554555653,null,"Salmo","",434.41001855057362,"Salvelinus","",638.17632596029205,"Daphnia","",985.25892001760678,"Lampsilis","",1026.1097707747783]
[null,"Site 38",1,100,7,7542.8737034161522,1960.7253936241273,980,380," ","Daphnia","",2324.837284676019,"Micropterus","",2987.6319235481492,"Oncorhynchus","",3312.0824262524493,"Ceriodaphnia","",7770.4797554555653,null,"Salmo","",434.41001855057362,"Salvelinus","",638.17632596029205,"Daphnia","",985.25892001760678,"Lampsilis","",1026.1097707747783]
[null,"Site 39",1,100,7,7542.8737034161522,1960.7253936241273,980,380," ","Daphnia","",2324.837284676019,"Micropterus","",2987.6319235481492,"Oncorhynchus","",3312.0824262524493,"Ceriodaphnia","",7770.4797554555653,null,"Salmo","",434.41001855057362,"Salvelinus","",638.17632596029205,"Daphnia","",985.25892001760678,"Lampsilis","",1026.1097707747783]
[null,"Site 40",1,100,7,7542.8737034161522,1960.7253936241273,980,380," ","Daphnia","",2324.837284676019,"Micropterus","",2987.6319235481492,"Oncorhynchus","",3312.0824262524493,"Ceriodaphnia","",7770.4797554555653,null,"Salmo","",434.41001855057362,"Salvelinus","",638.17632596029205,"Daphnia","",985.25892001760678,"Lampsilis","",1026.1097707747783]
[null,"Site 41",1,100,7,7542.8737034161522,1960.7253936241273,980,380," ","Daphnia","",2324.837284676019,"Micropterus","",2987.6319235481492,"Oncorhynchus","",3312.0824262524493,"Ceriodaphnia","",7770.4797554555653,null,"Salmo","",434.41001855057362,"Salvelinus","",638.17632596029205,"Daphnia","",985.25892001760678,"Lampsilis","",1026.1097707747783]
[null,"Site 42",1,100,7,7542.8737034161522,1960.7253936241273,980,380," ","Daphnia","",2324.837284676019,"Micropterus","",2987.6319235481492,"Oncorhynchus","",3312.0824262524493,"Ceriodaphnia","",7770.4797554555653,null,"Salmo","",434.41001855057362,"Salvelinus","",638.17632596029205,"Daphnia","",985.25892001760678,"Lampsilis","",1026.1097707747783]
[null,"Site 43",1,100,7,7542.8737034161522,1960.7253936241273,980,380," ","Daphnia","",2324.837284676019,"Micropterus","",2987.6319235481492,"Oncorhynchus","",3312.0824262524493,"Ceriodaphnia","",7770.4797554555653,null,"Salmo","",434.41001855057362,"Salvelinus","",638.17632596029205,"Daphnia","",985.25892001760678,"Lampsilis","",1026.1097707747783]
[null,"Site 44",1,100,7,7542.8737034161522,1960.7253936241273,980,380," ","Daphnia","",2324.837284676019,"Micropterus","",2987.6319235481492,"Oncorhynchus","",3312.0824262524493,"Ceriodaphnia","",7770.4797554555653,null,"Salmo","",434.41001855057362,"Salvelinus","",638.17632596029205,"Daphnia","",985.25892001760678,"Lampsilis","",1026.1097707747783]
[null,"Site 45",1,100,7,7542.8737034161522,1960.7253936241273,980,380," ","Daphnia","",2324.837284676019,"Micropterus","",2987.6319235481492,"Oncorhynchus","",3312.0824262524493,"Ceriodaphnia","",7770.4797554555653,null,"Salmo","",434.41001855057362,"Salvelinus","",638.17632596029205,"Daphnia","",985.25892001760678,"Lampsilis","",1026.1097707747783]
[null,"Site 46",1,100,7,7542.8737034161522,1960.7253936241273,980,380," ","Daphnia","",2324.837284676019,"Micropterus","",2987.6319235481492,"Oncorhynchus","",3312.0824262524493,"Ceriodaphnia","",7770.4797554555653,null,"Salmo","",434.41001855057362,"Salvelinus","",638.17632596029205,"Daphnia","",985.25892001760678,"Lampsilis","",1026.1097707747783]
[null,"Site 47",1,100,7,7542.8737034161522,1960.7253936241273,980,380," ","Daphnia","",2324.837284676019,"Micropterus","",2987.6319235481492,"Oncorhynchus","",3312.0824262524493,"Ceriodaphnia","",7770.4797554555653,null,"Salmo","",434.41001855057362,"Salvelinus","",638.17632596029205,"Daphnia","",985.25892001760678,"Lampsilis","",1026.1097707747783]
[null,"Site 48",1,100,7,7542.8737034161522,1960.7253936241273,980,380," ","Daphnia","",2324.837284676019,"Micropterus","",2987.6319235481492,"Oncorhynchus","",3312.0824262524493,"Ceriodaphnia","",7770.4797554555653,null,"Salmo","",434.41001855057362,"Salvelinus","",638.17632596029205,"Daphnia","",985.25892001760678,"Lampsilis","",1026.1097707747783]
[null,"Site 49",1,100,7,7542.8737034161522,1960.7253936241273,980,380," ","Daphnia","",2324.837284676019,"Micropterus","",2987.6319235481492,"Oncorhynchus","",3312.0824262524493,"Ceriodaphnia","",7770.4797554555653,null,"Salmo","",434.41001855057362,"Salvelinus","",638.17632596029205,"Daphnia","",985.25892001760678,"Lampsilis","",1026.1097707747783]
[null,"Site 50",1,100,7,7542.8737034161522,1960.7253936241273,980,380," ","Daphnia","",2324.837284676019,"Micropterus","",2987.6319235481492,"Oncorhynchus","",3312.0824262524493,"Ceriodaphnia","",7770.4797554555653,null,"Salmo","",434.41001855057362,"Salvelinus","",638.17632596029205,"Daphnia","",985.25892001760678,"Lampsilis","",1026.1097707747783]
[null,"Site 51",1,100,7,7542.8737034161522,1960.7253936241273,980,380," ","Daphnia","",2324.837284676019,"Micropterus","",2987.6319235481492,"Oncorhynchus","",3312.0824262524493,"Ceriodaphnia","",7770.4797554555653,null,"Salmo","",434.41001855057362,"Salvelinus","",638.17632596029205,"Daphnia","",985.25892001760678,"Lampsilis","",1026.1097707747783]
[null,"Site 52",1,100,7,7542.8737034161522,1960.7253936241273,980,380," ","Daphnia","",2324.837284676019,"Micropterus","",2987.6319235481492,"Oncorhynchus","",3312.0824262524493,"Ceriodaphnia","",7770.4797554555653,null,"Salmo","",434.41001855057362,"Salvelinus","",638.17632596029205,"Daphnia","",985.25892001760678,"Lampsilis","",1026.1097707747783]
[null,"Site 53",1,100,7,7542.8737034161522,1960.7253936241273,980,380," ","Daphnia","",2324.837284676019,"Micropterus","",2987.6319235481492,"Oncorhynchus","",3312.0824262524493,"Ceriodaphnia","",7770.4797554555653,null,"Salmo","",434.41001855057362,"Salvelinus","",638.17632596029205,"Daphnia","",985.25892001760678,"Lampsilis","",1026.1097707747783]
[null,"Site 54",1,100,7,7542.8737034161522,1960.7253936241273,980,380," ","Daphnia","",2324.837284676019,"Micropterus","",2987.6319235481492,"Oncorhynchus","",3312.0824262524493,"Ceriodaphnia","",7770.4797554555653,null,"Salmo","",434.41001855057362,"Salvelinus","",638.17632596029205,"Daphnia","",985.25892001760678,"Lampsilis","",1026.1097707747783]
[null,"Site 55",1,100,7,7542.8737034161522,1960.7253936241273,980,380," ","Daphnia","",2324.837284676019,"Micropterus","",2987.6319235481492,"Oncorhynchus","",3312.0824262524493,"Ceriodaphnia","",7770.4797554555653,null,"Salmo","",434.41001855057362,"Salvelinus","",638.17632596029205,"Daphnia","",985.25892001760678,"Lampsilis","",1026.1097707747783]
[null,"Site 56",1,100,7,7542.8737034161522,1960.7253936241273,980,380," ","Daphnia","",2324.837284676019,"Micropterus","",2987.6319235481492,"Oncorhynchus","",3312.0824262524493,"Ceriodaphnia","",7770.4797554555653,null,"Salmo","",434.41001855057362,"Salvelinus","",638.17632596029205,"Daphnia","",985.25892001760678,"Lampsilis","",1026.1097707747783]
[null,"Site 57",1,100,7,7542.8737034161522,1960.7253936241273,980,380," ","Daphnia","",2324.837284676019,"Micropterus","",2987.6319235481492,"Oncorhynchus","",3312.0824262524493,"Ceriodaphnia","",7770.4797554555653,null,"Salmo","",434.41001855057362,"Salvelinus","",638.17632596029205,"Daphnia","",985.25892001760678,"Lampsilis","",1026.1097707747783]
[null,"Site 58",1,100,7,7542.8737034161522,1960.7253936241273,980,380," ","Daphnia","",2324.837284676019,"Micropterus","",2987.6319235481492,"Oncorhynchus","",3312.0824262524493,"Ceriodaphnia","",7770.4797554555653,null,"Salmo","",434.41001855057362,"Salvelinus","",638.17632596029205,"Daphnia","",985.25892001760678,"Lampsilis","",1026.1097707747783]
[null,"Site 59",1,100,7,7542.8737034161522,1960.7253936241273,980,380," ","Daphnia","",2324.837284676019,"Micropterus","",2987.6319235481492,"Oncorhynchus","",3312.0824262524493,"Ceriodaphnia","",7770.4797554555653,null,"Salmo","",434.41001855057362,"Salvelinus","",638.17632596029205,"Daphnia","",985.25892001760678,"Lampsilis","",1026.1097707747783]
[null,"Site 60",1,100,7,7542.8737034161522,1960.7253936241273,980,380," ","Daphnia","",2324.837284676019,"Micropterus","",2987.6319235481492,"Oncorhynchus","",3312.0824262524493,"Ceriodaphnia","",7770.4797554555653,null,"Salmo","",434.41001855057362,"Salvelinus","",638.17632596029205,"Daphnia","",985.25892001760678,"Lampsilis","",1026.1097707747783]
[null,"Site 61",1,100,7,7542.8737034161522,1960.7253936241273,980,380," ","Daphnia","",2324.837284676019,"Micropterus","",2987.6319235481492,"Oncorhynchus","",3312.0824262524493,"Ceriodaphnia","",7770.4797554555653,null,"Salmo","",434.41001855057362,"Salvelinus","",638.17632596029205,"Daphnia","",985.25892001760678,"Lampsilis","",1026.1097707747783]
[null,"Site 62",1,100,7,7542.8737034161522,1960.7253936241273,980,380," ","Daphnia","",2324.837284676019,"Micropterus","",2987.6319235481492,"Oncorhynchus","",3312.0824262524493,"Ceriodaphnia","",7770.4797554555653,null,"Salmo","",434.41001855057362,"Salvelinus","",638.17632596029205,"Daphnia","",985.25892001760678,"Lampsilis","",1026.1097707747783]
[null,"Site 63",1,100,7,7542.8737034161522,1960.7253936241273,980,380," ","Daphnia","",2324.837284676019,"Micropterus","",2987.6319235481492,"Oncorhynchus","",3312.0824262524493,"Ceriodaphnia","",7770.4797554555653,null,"Salmo","",434.41001855057362,"Salvelinus","",638.17632596029205,"Daphnia","",985.25892001760678,"Lampsilis","",1026.1097707747783]
[null,"Site 64",1,100,7,7542.8737034161522,1960.7253936241273,980,380," ","Daphnia","",2324.837284676019,"Micropterus","",2987.6319235481492,"Oncorhynchus","",3312.0824262524493,"Ceriodaphnia","",7770.4797554555653,null,"Salmo","",434.41001855057362,"Salvelinus","",638.17632596029205,"Daphnia","",985.25892001760678,"Lampsilis","",1026.1097707747783]
[null,"Site 65",1,100,7,7542.8737034161522,1960.7253936241273,980,380," ","Daphnia","",2324.837284676019,"Micropterus","",2987.6319235481492,"Oncorhynchus","",3312.0824262524493,"Ceriodaphnia","",7770.4797554555653,null,"Salmo","",434.41001855057362,"Salvelinus","",638.17632596029205,"Daphnia","",985.25892001760678,"Lampsilis","",1026.1097707747783]
[null,"Site 66",1,100,7,7542.8737034161522,1960.7253936241273,980,380,{"$f":"IF(OR(C75>12,D75>430,E75<6,E75>8.2),\"Outside model inputs\",\" \")","v":" "},"Daphnia","",2324.837284676019,"Micropterus","",2987.6319235481492,"Oncorhynchus","",3312.0824262524493,"Ceriodaphnia","",7770.4797554555653,null,"Salmo","",434.41001855057362,"Salvelinus","",638.17632596029205,"Daphnia","",985.25892001760678,"Lampsilis","",1026.1097707747783]
[null,"Site 67",1,100,7,7542.8737034161522,1960.7253936241273,980,380," ","Daphnia","",2324.837284676019,"Micropterus","",2987.6319235481492,"Oncorhynchus","",3312.0824262524493,"Ceriodaphnia","",7770.4797554555653,null,"Salmo","",434.41001855057362,"Salvelinus","",638.17632596029205,"Daphnia","",985.25892001760678,"Lampsilis","",1026.1097707747783]
[null,"Site 68",1,100,7,7542.8737034161522,1960.7253936241273,980,380," ","Daphnia","",2324.837284676019,"Micropterus","",2987.6319235481492,"Oncorhynchus","",3312.0824262524493,"Ceriodaphnia","",7770.4797554555653,null,"Salmo","",434.41001855057362,"Salvelinus","",638.17632596029205,"Daphnia","",985.25892001760678,"Lampsilis","",1026.1097707747783]
[null,"Site 69",1,100,7,7542.8737034161522,1960.7253936241273,980,380," ","Daphnia","",2324.837284676019,"Micropterus","",2987.6319235481492,"Oncorhynchus","",3312.0824262524493,"Ceriodaphnia","",7770.4797554555653,null,"Salmo","",434.41001855057362,"Salvelinus","",638.17632596029205,"Daphnia","",985.25892001760678,"Lampsilis","",1026.1097707747783]
[null,"Site 70",1,100,7,7542.8737034161522,1960.7253936241273,980,380," ","Daphnia","",2324.837284676019,"Micropterus","",2987.6319235481492,"Oncorhynchus","",3312.0824262524493,"Ceriodaphnia","",7770.4797554555653,null,"Salmo","",434.41001855057362,"Salvelinus","",638.17632596029205,"Daphnia","",985.25892001760678,"Lampsilis","",1026.1097707747783]
[null,"Site 71",1,100,7,7542.8737034161522,1960.7253936241273,980,380," ","Daphnia","",2324.837284676019,"Micropterus","",2987.6319235481492,"Oncorhynchus","",3312.0824262524493,"Ceriodaphnia","",7770.4797554555653,null,"Salmo","",434.41001855057362,"Salvelinus","",638.17632596029205,"Daphnia","",985.25892001760678,"Lampsilis","",1026.1097707747783]
[null,"Site 72",1,100,7,7542.8737034161522,1960.7253936241273,980,380," ","Daphnia","",2324.837284676019,"Micropterus","",2987.6319235481492,"Oncorhynchus","",3312.0824262524493,"Ceriodaphnia","",7770.4797554555653,null,"Salmo","",434.41001855057362,"Salvelinus","",638.17632596029205,"Daphnia","",985.25892001760678,"Lampsilis","",1026.1097707747783]
[null,"Site 73",1,100,7,7542.8737034161522,1960.7253936241273,980,380," ","Daphnia","",2324.837284676019,"Micropterus","",2987.6319235481492,"Oncorhynchus","",3312.0824262524493,"Ceriodaphnia","",7770.4797554555653,null,"Salmo","",434.41001855057362,"Salvelinus","",638.17632596029205,"Daphnia","",985.25892001760678,"Lampsilis","",1026.1097707747783]
[null,"Site 74",1,100,7,7542.8737034161522,1960.7253936241273,980,380," ","Daphnia","",2324.837284676019,"Micropterus","",2987.6319235481492,"Oncorhynchus","",3312.0824262524493,"Ceriodaphnia","",7770.4797554555653,null,"Salmo","",434.41001855057362,"Salvelinus","",638.17632596029205,"Daphnia","",985.25892001760678,"Lampsilis","",1026.1097707747783]
[null,"Site 75",1,100,7,7542.8737034161522,1960.7253936241273,980,380," ","Daphnia","",2324.837284676019,"Micropterus","",2987.6319235481492,"Oncorhynchus","",3312.0824262524493,"Ceriodaphnia","",7770.4797554555653,null,"Salmo","",434.41001855057362,"Salvelinus","",638.17632596029205,"Daphnia","",985.25892001760678,"Lampsilis","",1026.1097707747783]
[null,"Site 76",1,100,7,7542.8737034161522,1960.7253936241273,980,380," ","Daphnia","",2324.837284676019,"Micropterus","",2987.6319235481492,"Oncorhynchus","",3312.0824262524493,"Ceriodaphnia","",7770.4797554555653,null,"Salmo","",434.41001855057362,"Salvelinus","",638.17632596029205,"Daphnia","",985.25892001760678,"Lampsilis","",1026.1097707747783]
[null,"Site 77",1,100,7,7542.8737034161522,1960.7253936241273,980,380," ","Daphnia","",2324.837284676019,"Micropterus","",2987.6319235481492,"Oncorhynchus","",3312.0824262524493,"Ceriodaphnia","",7770.4797554555653,null,"Salmo","",434.41001855057362,"Salvelinus","",638.17632596029205,"Daphnia","",985.25892001760678,"Lampsilis","",1026.1097707747783]
[null,"Site 78",1,100,7,7542.8737034161522,1960.7253936241273,980,380," ","Daphnia","",2324.837284676019,"Micropterus","",2987.6319235481492,"Oncorhynchus","",3312.0824262524493,"Ceriodaphnia","",7770.4797554555653,null,"Salmo","",434.41001855057362,"Salvelinus","",638.17632596029205,"Daphnia","",985.25892001760678,"Lampsilis","",1026.1097707747783]
[null,"Site 79",1,100,7,7542.8737034161522,1960.7253936241273,980,380," ","Daphnia","",2324.837284676019,"Micropterus","",2987.6319235481492,"Oncorhynchus","",3312.0824262524493,"Ceriodaphnia","",7770.4797554555653,null,"Salmo","",434.41001855057362,"Salvelinus","",638.17632596029205,"Daphnia","",985.25892001760678,"Lampsilis","",1026.1097707747783]
[null,"Site 80",1,100,7,7542.8737034161522,1960.7253936241273,980,380," ","Daphnia","",2324.837284676019,"Micropterus","",2987.6319235481492,"Oncorhynchus","",3312.0824262524493,"Ceriodaphnia","",7770.4797554555653,null,"Salmo","",434.41001855057362,"Salvelinus","",638.17632596029205,"Daphnia","",985.25892001760678,"Lampsilis","",1026.1097707747783]
[null,"Site 81",1,100,7,7542.8737034161522,1960.7253936241273,980,380," ","Daphnia","",2324.837284676019,"Micropterus","",2987.6319235481492,"Oncorhynchus","",3312.0824262524493,"Ceriodaphnia","",7770.4797554555653,null,"Salmo","",434.41001855057362,"Salvelinus","",638.17632596029205,"Daphnia","",985.25892001760678,"Lampsilis","",1026.1097707747783]
[null,"Site 82",1,100,7,7542.8737034161522,1960.7253936241273,980,380," ","Daphnia","",2324.837284676019,"Micropterus","",2987.6319235481492,"Oncorhynchus","",3312.0824262524493,"Ceriodaphnia","",7770.4797554555653,null,"Salmo","",434.41001855057362,"Salvelinus","",638.17632596029205,"Daphnia","",985.25892001760678,"Lampsilis","",1026.1097707747783]
[null,"Site 83",1,100,7,7542.8737034161522,1960.7253936241273,980,380," ","Daphnia","",2324.837284676019,"Micropterus","",2987.6319235481492,"Oncorhynchus","",3312.0824262524493,"Ceriodaphnia","",7770.4797554555653,null,"Salmo","",434.41001855057362,"Salvelinus","",638.17632596029205,"Daphnia","",985.25892001760678,"Lampsilis","",1026.1097707747783]
[null,"Site 84",1,100,7,7542.8737034161522,1960.7253936241273,980,380," ","Daphnia","",2324.837284676019,"Micropterus","",2987.6319235481492,"Oncorhynchus","",3312.0824262524493,"Ceriodaphnia","",7770.4797554555653,null,"Salmo","",434.41001855057362,"Salvelinus","",638.17632596029205,"Daphnia","",985.25892001760678,"Lampsilis","",1026.1097707747783]
[null,"Site 85",1,100,7,7542.8737034161522,1960.7253936241273,980,380," ","Daphnia","",2324.837284676019,"Micropterus","",2987.6319235481492,"Oncorhynchus","",3312.0824262524493,"Ceriodaphnia","",7770.4797554555653,null,"Salmo","",434.41001855057362,"Salvelinus","",638.17632596029205,"Daphnia","",985.25892001760678,"Lampsilis","",1026.1097707747783]
[null,"Site 86",1,100,7,7542.8737034161522,1960.7253936241273,980,380," ","Daphnia","",2324.837284676019,"Micropterus","",2987.6319235481492,"Oncorhynchus","",3312.0824262524493,"Ceriodaphnia","",7770.4797554555653,null,"Salmo","",434.41001855057362,"Salvelinus","",638.17632596029205,"Daphnia","",985.25892001760678,"Lampsilis","",1026.1097707747783]
[null,"Site 87",1,100,7,7542.8737034161522,1960.7253936241273,980,380," ","Daphnia","",2324.837284676019,"Micropterus","",2987.6319235481492,"Oncorhynchus","",3312.0824262524493,"Ceriodaphnia","",7770.4797554555653,null,"Salmo","",434.41001855057362,"Salvelinus","",638.17632596029205,"Daphnia","",985.25892001760678,"Lampsilis","",1026.1097707747783]
[null,"Site 88",1,100,7,7542.8737034161522,1960.7253936241273,980,380," ","Daphnia","",2324.837284676019,"Micropterus","",2987.6319235481492,"Oncorhynchus","",3312.0824262524493,"Ceriodaphnia","",7770.4797554555653,null,"Salmo","",434.41001855057362,"Salvelinus","",638.17632596029205,"Daphnia","",985.25892001760678,"Lampsilis","",1026.1097707747783]
[null,"Site 89",1,100,7,7542.8737034161522,1960.7253936241273,980,380," ","Daphnia","",2324.837284676019,"Micropterus","",2987.6319235481492,"Oncorhynchus","",3312.0824262524493,"Ceriodaphnia","",7770.4797554555653,null,"Salmo","",434.41001855057362,"Salvelinus","",638.17632596029205,"Daphnia","",985.25892001760678,"Lampsilis","",1026.1097707747783]
[null,"Site 90",1,100,7,7542.8737034161522,1960.7253936241273,980,380," ","Daphnia","",2324.837284676019,"Micropterus","",2987.6319235481492,"Oncorhynchus","",3312.0824262524493,"Ceriodaphnia","",7770.4797554555653,null,"Salmo","",434.41001855057362,"Salvelinus","",638.17632596029205,"Daphnia","",985.25892001760678,"Lampsilis","",1026.1097707747783]
[null,"Site 91",1,100,7,7542.8737034161522,1960.7253936241273,980,380," ","Daphnia","",2324.837284676019,"Micropterus","",2987.6319235481492,"Oncorhynchus","",3312.0824262524493,"Ceriodaphnia","",7770.4797554555653,null,"Salmo","",434.41001855057362,"Salvelinus","",638.17632596029205,"Daphnia","",985.25892001760678,"Lampsilis","",1026.1097707747783]
[null,"Site 92",1,100,7,7542.8737034161522,1960.7253936241273,980,380," ","Daphnia","",2324.837284676019,"Micropterus","",2987.6319235481492,"Oncorhynchus","",3312.0824262524493,"Ceriodaphnia","",7770.4797554555653,null,"Salmo","",434.41001855057362,"Salvelinus","",638.17632596029205,"Daphnia","",985.25892001760678,"Lampsilis","",1026.1097707747783]
[null,"Site 93",1,100,7,7542.8737034161522,1960.7253936241273,980,380," ","Daphnia","",2324.837284676019,"Micropterus","",2987.6319235481492,"Oncorhynchus","",3312.0824262524493,"Ceriodaphnia","",7770.4797554555653,null,"Salmo","",434.41001855057362,"Salvelinus","",638.17632596029205,"Daphnia","",985.25892001760678,"Lampsilis","",1026.1097707747783]
[null,"Site 94",1,100,7,7542.8737034161522,1960.7253936241273,980,380," ","Daphnia","",2324.837284676019,"Micropterus","",2987.6319235481492,"Oncorhynchus","",3312.0824262524493,"Ceriodaphnia","",7770.4797554555653,null,"Salmo","",434.41001855057362,"Salvelinus","",638.17632596029205,"Daphnia","",985.25892001760678,"Lampsilis","",1026.1097707747783]
[null,"Site 95",1,100,7,7542.8737034161522,1960.7253936241273,980,380," ","Daphnia","",2324.837284676019,"Micropterus","",2987.6319235481492,"Oncorhynchus","",3312.0824262524493,"Ceriodaphnia","",7770.4797554555653,null,"Salmo","",434.41001855057362,"Salvelinus","",638.17632596029205,"Daphnia","",985.25892001760678,"Lampsilis","",1026.1097707747783]
[null,"Site 96",1,100,7,7542.8737034161522,1960.7253936241273,980,380," ","Daphnia","",2324.837284676019,"Micropterus","",2987.6319235481492,"Oncorhynchus","",3312.0824262524493,"Ceriodaphnia","",7770.4797554555653,null,"Salmo","",434.41001855057362,"Salvelinus","",638.17632596029205,"Daphnia","",985.25892001760678,"Lampsilis","",1026.1097707747783]
[null,"Site 97",1,100,7,7542.8737034161522,1960.7253936241273,980,380," ","Daphnia","",2324.837284676019,"Micropterus","",2987.6319235481492,"Oncorhynchus","",3312.0824262524493,"Ceriodaphnia","",7770.4797554555653,null,"Salmo","",434.41001855057362,"Salvelinus","",638.17632596029205,"Daphnia","",985.25892001760678,"Lampsilis","",1026.1097707747783]
[null,"Site 98",1,100,7,7542.8737034161522,1960.7253936241273,980,380," ","Daphnia","",2324.837284676019,"Micropterus","",2987.6319235481492,"Oncorhynchus","",3312.0824262524493,"Ceriodaphnia","",7770.4797554555653,null,"Salmo","",434.41001855057362,"Salvelinus","",638.17632596029205,"Daphnia","",985.25892001760678,"Lampsilis","",1026.1097707747783]
[null,"Site 99",1,100,7,7542.8737034161522,1960.7253936241273,980,380," ","Daphnia","",2324.837284676019,"Micropterus","",2987.6319235481492,"Oncorhynchus","",3312.0824262524493,"Ceriodaphnia","",7770.4797554555653,null,"Salmo","",434.41001855057362,"Salvelinus","",638.17632596029205,"Daphnia","",985.25892001760678,"Lampsilis","",1026.1097707747783]
[null,"Site 100",1,100,7,7542.8737034161522,1960.7253936241273,980,380," ","Daphnia","",2324.837284676019,"Micropterus","",2987.6319235481492,"Oncorhynchus","",3312.0824262524493,"Ceriodaphnia","",7770.4797554555653,null,"Salmo","",434.41001855057362,"Salvelinus","",638.17632596029205,"Daphnia","",985.25892001760678,"Lampsilis","",1026.1097707747783]
[null,"Site 101",1,100,7,7542.8737034161522,1960.7253936241273,980,380," ","Daphnia","",2324.837284676019,"Micropterus","",2987.6319235481492,"Oncorhynchus","",3312.0824262524493,"Ceriodaphnia","",7770.4797554555653,null,"Salmo","",434.41001855057362,"Salvelinus","",638.17632596029205,"Daphnia","",985.25892001760678,"Lampsilis","",1026.1097707747783]
[null,"Site 102",1,100,7,7542.8737034161522,1960.7253936241273,980,380," ","Daphnia","",2324.837284676019,"Micropterus","",2987.6319235481492,"Oncorhynchus","",3312.0824262524493,"Ceriodaphnia","",7770.4797554555653,null,"Salmo","",434.41001855057362,"Salvelinus","",638.17632596029205,"Daphnia","",985.25892001760678,"Lampsilis","",1026.1097707747783]
[null,"Site 103",1,100,7,7542.8737034161522,1960.7253936241273,980,380," ","Daphnia","",2324.837284676019,"Micropterus","",2987.6319235481492,"Oncorhynchus","",3312.0824262524493,"Ceriodaphnia","",7770.4797554555653,null,"Salmo","",434.41001855057362,"Salvelinus","",638.17632596029205,"Daphnia","",985.25892001760678,"Lampsilis","",1026.1097707747783]
[null,"Site 104",1,100,7,7542.8737034161522,1960.7253936241273,980,380," ","Daphnia","",2324.837284676019,"Micropterus","",2987.6319235481492,"Oncorhynchus","",3312.0824262524493,"Ceriodaphnia","",7770.4797554555653,null,"Salmo","",434.41001855057362,"Salvelinus","",638.17632596029205,"Daphnia","",985.25892001760678,"Lampsilis","",1026.1097707747783]
[null,"Site 105",1,100,7,7542.8737034161522,1960.7253936241273,980,380," ","Daphnia","",2324.837284676019,"Micropterus","",2987.6319235481492,"Oncorhynchus","",3312.0824262524493,"Ceriodaphnia","",7770.4797554555653,null,"Salmo","",434.41001855057362,"Salvelinus","",638.17632596029205,"Daphnia","",985.25892001760678,"Lampsilis","",1026.1097707747783]
[null,"Site 106",1,100,7,7542.8737034161522,1960.7253936241273,980,380," ","Daphnia","",2324.837284676019,"Micropterus","",2987.6319235481492,"Oncorhynchus","",3312.0824262524493,"Ceriodaphnia","",7770.4797554555653,null,"Salmo","",434.41001855057362,"Salvelinus","",638.17632596029205,"Daphnia","",985.25892001760678,"Lampsilis","",1026.1097707747783]
[null,"Site 107",1,100,7,7542.8737034161522,1960.7253936241273,980,380," ","Daphnia","",2324.837284676019,"Micropterus","",2987.6319235481492,"Oncorhynchus","",3312.0824262524493,"Ceriodaphnia","",7770.4797554555653,null,"Salmo","",434.41001855057362,"Salvelinus","",638.17632596029205,"Daphnia","",985.25892001760678,"Lampsilis","",1026.1097707747783]
[null,"Site 108",1,100,7,7542.8737034161522,1960.7253936241273,980,380," ","Daphnia","",2324.837284676019,"Micropterus","",2987.6319235481492,"Oncorhynchus","",3312.0824262524493,"Ceriodaphnia","",7770.4797554555653,null,"Salmo","",434.41001855057362,"Salvelinus","",638.17632596029205,"Daphnia","",985.25892001760678,"Lampsilis","",1026.1097707747783]
[null,"Site 109",1,100,7,7542.8737034161522,1960.7253936241273,980,380," ","Daphnia","",2324.837284676019,"Micropterus","",2987.6319235481492,"Oncorhynchus","",3312.0824262524493,"Ceriodaphnia","",7770.4797554555653,null,"Salmo","",434.41001855057362,"Salvelinus","",638.17632596029205,"Daphnia","",985.25892001760678,"Lampsilis","",1026.1097707747783]
[null,"Site 110",1,100,7,7542.8737034161522,1960.7253936241273,980,380," ","Daphnia","",2324.837284676019,"Micropterus","",2987.6319235481492,"Oncorhynchus","",3312.0824262524493,"Ceriodaphnia","",7770.4797554555653,null,"Salmo","",434.41001855057362,"Salvelinus","",638.17632596029205,"Daphnia","",985.25892001760678,"Lampsilis","",1026.1097707747783]
[null,"Site 111",1,100,7,7542.8737034161522,1960.7253936241273,980,380," ","Daphnia","",2324.837284676019,"Micropterus","",2987.6319235481492,"Oncorhynchus","",3312.0824262524493,"Ceriodaphnia","",7770.4797554555653,null,"Salmo","",434.41001855057362,"Salvelinus","",638.17632596029205,"Daphnia","",985.25892001760678,"Lampsilis","",1026.1097707747783]
[null,"Site 112",1,100,7,7542.8737034161522,1960.7253936241273,980,380," ","Daphnia","",2324.837284676019,"Micropterus","",2987.6319235481492,"Oncorhynchus","",3312.0824262524493,"Ceriodaphnia","",7770.4797554555653,null,"Salmo","",434.41001855057362,"Salvelinus","",638.17632596029205,"Daphnia","",985.25892001760678,"Lampsilis","",1026.1097707747783]
[null,"Site 113",1,100,7,7542.8737034161522,1960.7253936241273,980,380," ","Daphnia","",2324.837284676019,"Micropterus","",2987.6319235481492,"Oncorhynchus","",3312.0824262524493,"Ceriodaphnia","",7770.4797554555653,null,"Salmo","",434.41001855057362,"Salvelinus","",638.17632596029205,"Daphnia","",985.25892001760678,"Lampsilis","",1026.1097707747783]
[null,"Site 114",1,100,7,7542.8737034161522,1960.7253936241273,980,380," ","Daphnia","",2324.837284676019,"Micropterus","",2987.6319235481492,"Oncorhynchus","",3312.0824262524493,"Ceriodaphnia","",7770.4797554555653,null,"Salmo","",434.41001855057362,"Salvelinus","",638.17632596029205,"Daphnia","",985.25892001760678,"Lampsilis","",1026.1097707747783]
[null,"Site 115",1,100,7,7542.8737034161522,1960.7253936241273,980,380," ","Daphnia","",2324.837284676019,"Micropterus","",2987.6319235481492,"Oncorhynchus","",3312.0824262524493,"Ceriodaphnia","",7770.4797554555653,null,"Salmo","",434.41001855057362,"Salvelinus","",638.17632596029205,"Daphnia","",985.25892001760678,"Lampsilis","",1026.1097707747783]
[null,"Site 116",1,100,7,7542.8737034161522,1960.7253936241273,980,380," ","Daphnia","",2324.837284676019,"Micropterus","",2987.6319235481492,"Oncorhynchus","",3312.0824262524493,"Ceriodaphnia","",7770.4797554555653,null,"Salmo","",434.41001855057362,"Salvelinus","",638.17632596029205,"Daphnia","",985.25892001760678,"Lampsilis","",1026.1097707747783]
[null,"Site 117",1,100,7,7542.8737034161522,1960.7253936241273,980,380," ","Daphnia","",2324.837284676019,"Micropterus","",2987.6319235481492,"Oncorhynchus","",3312.0824262524493,"Ceriodaphnia","",7770.4797554555653,null,"Salmo","",434.41001855057362,"Salvelinus","",638.17632596029205,"Daphnia","",985.25892001760678,"Lampsilis","",1026.1097707747783]
[null,"Site 118",1,100,7,7542.8737034161522,1960.7253936241273,980,380," ","Daphnia","",2324.837284676019,"Micropterus","",2987.6319235481492,"Oncorhynchus","",3312.0824262524493,"Ceriodaphnia","",7770.4797554555653,null,"Salmo","",434.41001855057362,"Salvelinus","",638.17632596029205,"Daphnia","",985.25892001760678,"Lampsilis","",1026.1097707747783]
[null,"Site 119",1,100,7,7542.8737034161522,1960.7253936241273,980,380," ","Daphnia","",2324.837284676019,"Micropterus","",2987.6319235481492,"Oncorhynchus","",3312.0824262524493,"Ceriodaphnia","",7770.4797554555653,null,"Salmo","",434.41001855057362,"Salvelinus","",638.17632596029205,"Daphnia","",985.25892001760678,"Lampsilis","",1026.1097707747783]
[null,"Site 120",1,100,7,7542.8737034161522,1960.7253936241273,980,380," ","Daphnia","",2324.837284676019,"Micropterus","",2987.6319235481492,"Oncorhynchus","",3312.0824262524493,"Ceriodaphnia","",7770.4797554555653,null,"Salmo","",434.41001855057362,"Salvelinus","",638.17632596029205,"Daphnia","",985.25892001760678,"Lampsilis","",1026.1097707747783]
[null,"Site 121",1,100,7,7542.8737034161522,1960.7253936241273,980,380," ","Daphnia","",2324.837284676019,"Micropterus","",2987.6319235481492,"Oncorhynchus","",3312.0824262524493,"Ceriodaphnia","",7770.4797554555653,null,"Salmo","",434.41001855057362,"Salvelinus","",638.17632596029205,"Daphnia","",985.25892001760678,"Lampsilis","",1026.1097707747783]
[null,"Site 122",1,100,7,7542.8737034161522,1960.7253936241273,980,380," ","Daphnia","",2324.837284676019,"Micropterus","",2987.6319235481492,"Oncorhynchus","",3312.0824262524493,"Ceriodaphnia","",7770.4797554555653,null,"Salmo","",434.41001855057362,"Salvelinus","",638.17632596029205,"Daphnia","",985.25892001760678,"Lampsilis","",1026.1097707747783]
[null,"Site 123",1,100,7,7542.8737034161522,1960.7253936241273,980,380," ","Daphnia","",2324.837284676019,"Micropterus","",2987.6319235481492,"Oncorhynchus","",3312.0824262524493,"Ceriodaphnia","",7770.4797554555653,null,"Salmo","",434.41001855057362,"Salvelinus","",638.17632596029205,"Daphnia","",985.25892001760678,"Lampsilis","",1026.1097707747783]
[null,"Site 124",1,100,7,7542.8737034161522,1960.7253936241273,980,380," ","Daphnia","",2324.837284676019,"Micropterus","",2987.6319235481492,"Oncorhynchus","",3312.0824262524493,"Ceriodaphnia","",7770.4797554555653,null,"Salmo","",434.41001855057362,"Salvelinus","",638.17632596029205,"Daphnia","",985.25892001760678,"Lampsilis","",1026.1097707747783]
[null,"Site 125",1,100,7,7542.8737034161522,1960.7253936241273,980,380," ","Daphnia","",2324.837284676019,"Micropterus","",2987.6319235481492,"Oncorhynchus","",3312.0824262524493,"Ceriodaphnia","",7770.4797554555653,null,"Salmo","",434.41001855057362,"Salvelinus","",638.17632596029205,"Daphnia","",985.25892001760678,"Lampsilis","",1026.1097707747783]
[null,"Site 126",1,100,7,7542.8737034161522,1960.7253936241273,980,380," ","Daphnia","",2324.837284676019,"Micropterus","",2987.6319235481492,"Oncorhynchus","",3312.0824262524493,"Ceriodaphnia","",7770.4797554555653,null,"Salmo","",434.41001855057362,"Salvelinus","",638.17632596029205,"Daphnia","",985.25892001760678,"Lampsilis","",1026.1097707747783]
[null,"Site 127",1,100,7,7542.8737034161522,1960.7253936241273,980,380," ","Daphnia","",2324.837284676019,"Micropterus","",2987.6319235481492,"Oncorhynchus","",3312.0824262524493,"Ceriodaphnia","",7770.4797554555653,null,"Salmo","",434.41001855057362,"Salvelinus","",638.17632596029205,"Daphnia","",985.25892001760678,"Lampsilis","",1026.1097707747783]
[null,"Site 128",1,100,7,7542.8737034161522,1960.7253936241273,980,380," ","Daphnia","",2324.837284676019,"Micropterus","",2987.6319235481492,"Oncorhynchus","",3312.0824262524493,"Ceriodaphnia","",7770.4797554555653,null,"Salmo","",434.41001855057362,"Salvelinus","",638.17632596029205,"Daphnia","",985.25892001760678,"Lampsilis","",1026.1097707747783]
[null,"Site 129",1,100,7,7542.8737034161522,1960.7253936241273,980,380," ","Daphnia","",2324.837284676019,"Micropterus","",2987.6319235481492,"Oncorhynchus","",3312.0824262524493,"Ceriodaphnia","",7770.4797554555653,null,"Salmo","",434.41001855057362,"Salvelinus","",638.17632596029205,"Daphnia","",985.25892001760678,"Lampsilis","",1026.1097707747783]
[null,"Site 130",1,100,7,7542.8737034161522,1960.7253936241273,980,380,{"$f":"IF(OR(C139>12,D139>430,E139<6,E139>8.2),\"Outside model inputs\",\" \")","v":" "},"Daphnia","",2324.837284676019,"Micropterus","",2987.6319235481492,"Oncorhynchus","",3312.0824262524493,"Ceriodaphnia","",7770.4797554555653,null,"Salmo","",434.41001855057362,"Salvelinus","",638.17632596029205,"Daphnia","",985.25892001760678,"Lampsilis","",1026.1097707747783]
[null,"Site 131",1,100,7,7542.8737034161522,1960.7253936241273,980,380," ","Daphnia","",2324.837284676019,"Micropterus","",2987.6319235481492,"Oncorhynchus","",3312.0824262524493,"Ceriodaphnia","",7770.4797554555653,null,"Salmo","",434.41001855057362,"Salvelinus","",638.17632596029205,"Daphnia","",985.25892001760678,"Lampsilis","",1026.1097707747783]
[null,"Site 132",1,100,7,7542.8737034161522,1960.7253936241273,980,380," ","Daphnia","",2324.837284676019,"Micropterus","",2987.6319235481492,"Oncorhynchus","",3312.0824262524493,"Ceriodaphnia","",7770.4797554555653,null,"Salmo","",434.41001855057362,"Salvelinus","",638.17632596029205,"Daphnia","",985.25892001760678,"Lampsilis","",1026.1097707747783]
[null,"Site 133",1,100,7,7542.8737034161522,1960.7253936241273,980,380," ","Daphnia","",2324.837284676019,"Micropterus","",2987.6319235481492,"Oncorhynchus","",3312.0824262524493,"Ceriodaphnia","",7770.4797554555653,null,"Salmo","",434.41001855057362,"Salvelinus","",638.17632596029205,"Daphnia","",985.25892001760678,"Lampsilis","",1026.1097707747783]
[null,"Site 134",1,100,7,7542.8737034161522,1960.7253936241273,980,380," ","Daphnia","",2324.837284676019,"Micropterus","",2987.6319235481492,"Oncorhynchus","",3312.0824262524493,"Ceriodaphnia","",7770.4797554555653,null,"Salmo","",434.41001855057362,"Salvelinus","",638.17632596029205,"Daphnia","",985.25892001760678,"Lampsilis","",1026.1097707747783]
[null,"Site 135",1,100,7,7542.8737034161522,1960.7253936241273,980,380," ","Daphnia","",2324.837284676019,"Micropterus","",2987.6319235481492,"Oncorhynchus","",3312.0824262524493,"Ceriodaphnia","",7770.4797554555653,null,"Salmo","",434.41001855057362,"Salvelinus","",638.17632596029205,"Daphnia","",985.25892001760678,"Lampsilis","",1026.1097707747783]
[null,"Site 136",1,100,7,7542.8737034161522,1960.7253936241273,980,380," ","Daphnia","",2324.837284676019,"Micropterus","",2987.6319235481492,"Oncorhynchus","",3312.0824262524493,"Ceriodaphnia","",7770.4797554555653,null,"Salmo","",434.41001855057362,"Salvelinus","",638.17632596029205,"Daphnia","",985.25892001760678,"Lampsilis","",1026.1097707747783]
[null,"Site 137",1,100,7,7542.8737034161522,1960.7253936241273,980,380," ","Daphnia","",2324.837284676019,"Micropterus","",2987.6319235481492,"Oncorhynchus","",3312.0824262524493,"Ceriodaphnia","",7770.4797554555653,null,"Salmo","",434.41001855057362,"Salvelinus","",638.17632596029205,"Daphnia","",985.25892001760678,"Lampsilis","",1026.1097707747783]
[null,"Site 138",1,100,7,7542.8737034161522,1960.7253936241273,980,380," ","Daphnia","",2324.837284676019,"Micropterus","",2987.6319235481492,"Oncorhynchus","",3312.0824262524493,"Ceriodaphnia","",7770.4797554555653,null,"Salmo","",434.41001855057362,"Salvelinus","",638.17632596029205,"Daphnia","",985.25892001760678,"Lampsilis","",1026.1097707747783]
[null,"Site 139",1,100,7,7542.8737034161522,1960.7253936241273,980,380," ","Daphnia","",2324.837284676019,"Micropterus","",2987.6319235481492,"Oncorhynchus","",3312.0824262524493,"Ceriodaphnia","",7770.4797554555653,null,"Salmo","",434.41001855057362,"Salvelinus","",638.17632596029205,"Daphnia","",985.25892001760678,"Lampsilis","",1026.1097707747783]
[null,"Site 140",1,100,7,7542.8737034161522,1960.7253936241273,980,380," ","Daphnia","",2324.837284676019,"Micropterus","",2987.6319235481492,"Oncorhynchus","",3312.0824262524493,"Ceriodaphnia","",7770.4797554555653,null,"Salmo","",434.41001855057362,"Salvelinus","",638.17632596029205,"Daphnia","",985.25892001760678,"Lampsilis","",1026.1097707747783]
[null,"Site 141",1,100,7,7542.8737034161522,1960.7253936241273,980,380," ","Daphnia","",2324.837284676019,"Micropterus","",2987.6319235481492,"Oncorhynchus","",3312.0824262524493,"Ceriodaphnia","",7770.4797554555653,null,"Salmo","",434.41001855057362,"Salvelinus","",638.17632596029205,"Daphnia","",985.25892001760678,"Lampsilis","",1026.1097707747783]
[null,"Site 142",1,100,7,7542.8737034161522,1960.7253936241273,980,380," ","Daphnia","",2324.837284676019,"Micropterus","",2987.6319235481492,"Oncorhynchus","",3312.0824262524493,"Ceriodaphnia","",7770.4797554555653,null,"Salmo","",434.41001855057362,"Salvelinus","",638.17632596029205,"Daphnia","",985.25892001760678,"Lampsilis","",1026.1097707747783]
[null,"Site 143",1,100,7,7542.8737034161522,1960.7253936241273,980,380," ","Daphnia","",2324.837284676019,"Micropterus","",2987.6319235481492,"Oncorhynchus","",3312.0824262524493,"Ceriodaphnia","",7770.4797554555653,null,"Salmo","",434.41001855057362,"Salvelinus","",638.17632596029205,"Daphnia","",985.25892001760678,"Lampsilis","",1026.1097707747783]
[null,"Site 144",1,100,7,7542.8737034161522,1960.7253936241273,980,380," ","Daphnia","",2324.837284676019,"Micropterus","",2987.6319235481492,"Oncorhynchus","",3312.0824262524493,"Ceriodaphnia","",7770.4797554555653,null,"Salmo","",434.41001855057362,"Salvelinus","",638.17632596029205,"Daphnia","",985.25892001760678,"Lampsilis","",1026.1097707747783]
[null,"Site 145",1,100,7,7542.8737034161522,1960.7253936241273,980,380," ","Daphnia","",2324.837284676019,"Micropterus","",2987.6319235481492,"Oncorhynchus","",3312.0824262524493,"Ceriodaphnia","",7770.4797554555653,null,"Salmo","",434.41001855057362,"Salvelinus","",638.17632596029205,"Daphnia","",985.25892001760678,"Lampsilis","",1026.1097707747783]
[null,"Site 146",1,100,7,7542.8737034161522,1960.7253936241273,980,380," ","Daphnia","",2324.837284676019,"Micropterus","",2987.6319235481492,"Oncorhynchus","",3312.0824262524493,"Ceriodaphnia","",7770.4797554555653,null,"Salmo","",434.41001855057362,"Salvelinus","",638.17632596029205,"Daphnia","",985.25892001760678,"Lampsilis","",1026.1097707747783]
[null,"Site 147",1,100,7,7542.8737034161522,1960.7253936241273,980,380," ","Daphnia","",2324.837284676019,"Micropterus","",2987.6319235481492,"Oncorhynchus","",3312.0824262524493,"Ceriodaphnia","",7770.4797554555653,null,"Salmo","",434.41001855057362,"Salvelinus","",638.17632596029205,"Daphnia","",985.25892001760678,"Lampsilis","",1026.1097707747783]
[null,"Site 148",1,100,7,7542.8737034161522,1960.7253936241273,980,380," ","Daphnia","",2324.837284676019,"Micropterus","",2987.6319235481492,"Oncorhynchus","",3312.0824262524493,"Ceriodaphnia","",7770.4797554555653,null,"Salmo","",434.41001855057362,"Salvelinus","",638.17632596029205,"Daphnia","",985.25892001760678,"Lampsilis","",1026.1097707747783]
[null,"Site 149",1,100,7,7542.8737034161522,1960.7253936241273,980,380," ","Daphnia","",2324.837284676019,"Micropterus","",2987.6319235481492,"Oncorhynchus","",3312.0824262524493,"Ceriodaphnia","",7770.4797554555653,null,"Salmo","",434.41001855057362,"Salvelinus","",638.17632596029205,"Daphnia","",985.25892001760678,"Lampsilis","",1026.1097707747783]
[null,"Site 150",1,100,7,7542.8737034161522,1960.7253936241273,980,380," ","Daphnia","",2324.837284676019,"Micropterus","",2987.6319235481492,"Oncorhynchus","",3312.0824262524493,"Ceriodaphnia","",7770.4797554555653,null,"Salmo","",434.41001855057362,"Salvelinus","",638.17632596029205,"Daphnia","",985.25892001760678,"Lampsilis","",1026.1097707747783]
[null,"Site 151",1,100,7,7542.8737034161522,1960.7253936241273,980,380," ","Daphnia","",2324.837284676019,"Micropterus","",2987.6319235481492,"Oncorhynchus","",3312.0824262524493,"Ceriodaphnia","",7770.4797554555653,null,"Salmo","",434.41001855057362,"Salvelinus","",638.17632596029205,"Daphnia","",985.25892001760678,"Lampsilis","",1026.1097707747783]
[null,"Site 152",1,100,7,7542.8737034161522,1960.7253936241273,980,380," ","Daphnia","",2324.837284676019,"Micropterus","",2987.6319235481492,"Oncorhynchus","",3312.0824262524493,"Ceriodaphnia","",7770.4797554555653,null,"Salmo","",434.41001855057362,"Salvelinus","",638.17632596029205,"Daphnia","",985.25892001760678,"Lampsilis","",1026.1097707747783]
[null,"Site 153",1,100,7,7542.8737034161522,1960.7253936241273,980,380," ","Daphnia","",2324.837284676019,"Micropterus","",2987.6319235481492,"Oncorhynchus","",3312.0824262524493,"Ceriodaphnia","",7770.4797554555653,null,"Salmo","",434.41001855057362,"Salvelinus","",638.17632596029205,"Daphnia","",985.25892001760678,"Lampsilis","",1026.1097707747783]
[null,"Site 154",1,100,7,7542.8737034161522,1960.7253936241273,980,380," ","Daphnia","",2324.837284676019,"Micropterus","",2987.6319235481492,"Oncorhynchus","",3312.0824262524493,"Ceriodaphnia","",7770.4797554555653,null,"Salmo","",434.41001855057362,"Salvelinus","",638.17632596029205,"Daphnia","",985.25892001760678,"Lampsilis","",1026.1097707747783]
[null,"Site 155",1,100,7,7542.8737034161522,1960.7253936241273,980,380," ","Daphnia","",2324.837284676019,"Micropterus","",2987.6319235481492,"Oncorhynchus","",3312.0824262524493,"Ceriodaphnia","",7770.4797554555653,null,"Salmo","",434.41001855057362,"Salvelinus","",638.17632596029205,"Daphnia","",985.25892001760678,"Lampsilis","",1026.1097707747783]
[null,"Site 156",1,100,7,7542.8737034161522,1960.7253936241273,980,380," ","Daphnia","",2324.837284676019,"Micropterus","",2987.6319235481492,"Oncorhynchus","",3312.0824262524493,"Ceriodaphnia","",7770.4797554555653,null,"Salmo","",434.41001855057362,"Salvelinus","",638.17632596029205,"Daphnia","",985.25892001760678,"Lampsilis","",1026.1097707747783]
[null,"Site 157",1,100,7,7542.8737034161522,1960.7253936241273,980,380," ","Daphnia","",2324.837284676019,"Micropterus","",2987.6319235481492,"Oncorhynchus","",3312.0824262524493,"Ceriodaphnia","",7770.4797554555653,null,"Salmo","",434.41001855057362,"Salvelinus","",638.17632596029205,"Daphnia","",985.25892001760678,"Lampsilis","",1026.1097707747783]
[null,"Site 158",1,100,7,7542.8737034161522,1960.7253936241273,980,380," ","Daphnia","",2324.837284676019,"Micropterus","",2987.6319235481492,"Oncorhynchus","",3312.0824262524493,"Ceriodaphnia","",7770.4797554555653,null,"Salmo","",434.41001855057362,"Salvelinus","",638.17632596029205,"Daphnia","",985.25892001760678,"Lampsilis","",1026.1097707747783]
[null,"Site 159",1,100,7,7542.8737034161522,1960.7253936241273,980,380," ","Daphnia","",2324.837284676019,"Micropterus","",2987.6319235481492,"Oncorhynchus","",3312.0824262524493,"Ceriodaphnia","",7770.4797554555653,null,"Salmo","",434.41001855057362,"Salvelinus","",638.17632596029205,"Daphnia","",985.25892001760678,"Lampsilis","",1026.1097707747783]
[null,"Site 160",1,100,7,7542.8737034161522,1960.7253936241273,980,380," ","Daphnia","",2324.837284676019,"Micropterus","",2987.6319235481492,"Oncorhynchus","",3312.0824262524493,"Ceriodaphnia","",7770.4797554555653,null,"Salmo","",434.41001855057362,"Salvelinus","",638.17632596029205,"Daphnia","",985.25892001760678,"Lampsilis","",1026.1097707747783]
[null,"Site 161",1,100,7,7542.8737034161522,1960.7253936241273,980,380," ","Daphnia","",2324.837284676019,"Micropterus","",2987.6319235481492,"Oncorhynchus","",3312.0824262524493,"Ceriodaphnia","",7770.4797554555653,null,"Salmo","",434.41001855057362,"Salvelinus","",638.17632596029205,"Daphnia","",985.25892001760678,"Lampsilis","",1026.1097707747783]
[null,"Site 162",1,100,7,7542.8737034161522,1960.7253936241273,980,380," ","Daphnia","",2324.837284676019,"Micropterus","",2987.6319235481492,"Oncorhynchus","",3312.0824262524493,"Ceriodaphnia","",7770.4797554555653,null,"Salmo","",434.41001855057362,"Salvelinus","",638.17632596029205,"Daphnia","",985.25892001760678,"Lampsilis","",1026.1097707747783]
[null,"Site 163",1,100,7,7542.8737034161522,1960.7253936241273,980,380," ","Daphnia","",2324.837284676019,"Micropterus","",2987.6319235481492,"Oncorhynchus","",3312.0824262524493,"Ceriodaphnia","",7770.4797554555653,null,"Salmo","",434.41001855057362,"Salvelinus","",638.17632596029205,"Daphnia","",985.25892001760678,"Lampsilis","",1026.1097707747783]
[null,"Site 164",1,100,7,7542.8737034161522,1960.7253936241273,980,380," ","Daphnia","",2324.837284676019,"Micropterus","",2987.6319235481492,"Oncorhynchus","",3312.0824262524493,"Ceriodaphnia","",7770.4797554555653,null,"Salmo","",434.41001855057362,"Salvelinus","",638.17632596029205,"Daphnia","",985.25892001760678,"Lampsilis","",1026.1097707747783]
[null,"Site 165",1,100,7,7542.8737034161522,1960.7253936241273,980,380," ","Daphnia","",2324.837284676019,"Micropterus","",2987.6319235481492,"Oncorhynchus","",3312.0824262524493,"Ceriodaphnia","",7770.4797554555653,null,"Salmo","",434.41001855057362,"Salvelinus","",638.17632596029205,"Daphnia","",985.25892001760678,"Lampsilis","",1026.1097707747783]
[null,"Site 166",1,100,7,7542.8737034161522,1960.7253936241273,980,380," ","Daphnia","",2324.837284676019,"Micropterus","",2987.6319235481492,"Oncorhynchus","",3312.0824262524493,"Ceriodaphnia","",7770.4797554555653,null,"Salmo","",434.41001855057362,"Salvelinus","",638.17632596029205,"Daphnia","",985.25892001760678,"Lampsilis","",1026.1097707747783]
[null,"Site 167",1,100,7,7542.8737034161522,1960.7253936241273,980,380," ","Daphnia","",2324.837284676019,"Micropterus","",2987.6319235481492,"Oncorhynchus","",3312.0824262524493,"Ceriodaphnia","",7770.4797554555653,null,"Salmo","",434.41001855057362,"Salvelinus","",638.17632596029205,"Daphnia","",985.25892001760678,"Lampsilis","",1026.1097707747783]
[null,"Site 168",1,100,7,7542.8737034161522,1960.7253936241273,980,380," ","Daphnia","",2324.837284676019,"Micropterus","",2987.6319235481492,"Oncorhynchus","",3312.0824262524493,"Ceriodaphnia","",7770.4797554555653,null,"Salmo","",434.41001855057362,"Salvelinus","",638.17632596029205,"Daphnia","",985.25892001760678,"Lampsilis","",1026.1097707747783]
[null,"Site 169",1,100,7,7542.8737034161522,1960.7253936241273,980,380," ","Daphnia","",2324.837284676019,"Micropterus","",2987.6319235481492,"Oncorhynchus","",3312.0824262524493,"Ceriodaphnia","",7770.4797554555653,null,"Salmo","",434.41001855057362,"Salvelinus","",638.17632596029205,"Daphnia","",985.25892001760678,"Lampsilis","",1026.1097707747783]
[null,"Site 170",1,100,7,7542.8737034161522,1960.7253936241273,980,380," ","Daphnia","",2324.837284676019,"Micropterus","",2987.6319235481492,"Oncorhynchus","",3312.0824262524493,"Ceriodaphnia","",7770.4797554555653,null,"Salmo","",434.41001855057362,"Salvelinus","",638.17632596029205,"Daphnia","",985.25892001760678,"Lampsilis","",1026.1097707747783]
[null,"Site 171",1,100,7,7542.8737034161522,1960.7253936241273,980,380," ","Daphnia","",2324.837284676019,"Micropterus","",2987.6319235481492,"Oncorhynchus","",3312.0824262524493,"Ceriodaphnia","",7770.4797554555653,null,"Salmo","",434.41001855057362,"Salvelinus","",638.17632596029205,"Daphnia","",985.25892001760678,"Lampsilis","",1026.1097707747783]
[null,"Site 172",1,100,7,7542.8737034161522,1960.7253936241273,980,380," ","Daphnia","",2324.837284676019,"Micropterus","",2987.6319235481492,"Oncorhynchus","",3312.0824262524493,"Ceriodaphnia","",7770.4797554555653,null,"Salmo","",434.41001855057362,"Salvelinus","",638.17632596029205,"Daphnia","",985.25892001760678,"Lampsilis","",1026.1097707747783]
[null,"Site 173",1,100,7,7542.8737034161522,1960.7253936241273,980,380," ","Daphnia","",2324.837284676019,"Micropterus","",2987.6319235481492,"Oncorhynchus","",3312.0824262524493,"Ceriodaphnia","",7770.4797554555653,null,"Salmo","",434.41001855057362,"Salvelinus","",638.17632596029205,"Daphnia","",985.25892001760678,"Lampsilis","",1026.1097707747783]
[null,"Site 174",1,100,7,7542.8737034161522,1960.7253936241273,980,380," ","Daphnia","",2324.837284676019,"Micropterus","",2987.6319235481492,"Oncorhynchus","",3312.0824262524493,"Ceriodaphnia","",7770.4797554555653,null,"Salmo","",434.41001855057362,"Salvelinus","",638.17632596029205,"Daphnia","",985.25892001760678,"Lampsilis","",1026.1097707747783]
[null,"Site 175",1,100,7,7542.8737034161522,1960.7253936241273,980,380," ","Daphnia","",2324.837284676019,"Micropterus","",2987.6319235481492,"Oncorhynchus","",3312.0824262524493,"Ceriodaphnia","",7770.4797554555653,null,"Salmo","",434.41001855057362,"Salvelinus","",638.17632596029205,"Daphnia","",985.25892001760678,"Lampsilis","",1026.1097707747783]
[null,"Site 176",1,100,7,7542.8737034161522,1960.7253936241273,980,380," ","Daphnia","",2324.837284676019,"Micropterus","",2987.6319235481492,"Oncorhynchus","",3312.0824262524493,"Ceriodaphnia","",7770.4797554555653,null,"Salmo","",434.41001855057362,"Salvelinus","",638.17632596029205,"Daphnia","",985.25892001760678,"Lampsilis","",1026.1097707747783]
[null,"Site 177",1,100,7,7542.8737034161522,1960.7253936241273,980,380," ","Daphnia","",2324.837284676019,"Micropterus","",2987.6319235481492,"Oncorhynchus","",3312.0824262524493,"Ceriodaphnia","",7770.4797554555653,null,"Salmo","",434.41001855057362,"Salvelinus","",638.17632596029205,"Daphnia","",985.25892001760678,"Lampsilis","",1026.1097707747783]
[null,"Site 178",1,100,7,7542.8737034161522,1960.7253936241273,980,380," ","Daphnia","",2324.837284676019,"Micropterus","",2987.6319235481492,"Oncorhynchus","",3312.0824262524493,"Ceriodaphnia","",7770.4797554555653,null,"Salmo","",434.41001855057362,"Salvelinus","",638.17632596029205,"Daphnia","",985.25892001760678,"Lampsilis","",1026.1097707747783]
[null,"Site 179",1,100,7,7542.8737034161522,1960.7253936241273,980,380," ","Daphnia","",2324.837284676019,"Micropterus","",2987.6319235481492,"Oncorhynchus","",3312.0824262524493,"Ceriodaphnia","",7770.4797554555653,null,"Salmo","",434.41001855057362,"Salvelinus","",638.17632596029205,"Daphnia","",985.25892001760678,"Lampsilis","",1026.1097707747783]
[null,"Site 180",1,100,7,7542.8737034161522,1960.7253936241273,980,380," ","Daphnia","",2324.837284676019,"Micropterus","",2987.6319235481492,"Oncorhynchus","",3312.0824262524493,"Ceriodaphnia","",7770.4797554555653,null,"Salmo","",434.41001855057362,"Salvelinus","",638.17632596029205,"Daphnia","",985.25892001760678,"Lampsilis","",1026.1097707747783]
[null,"Site 181",1,100,7,7542.8737034161522,1960.7253936241273,980,380," ","Daphnia","",2324.837284676019,"Micropterus","",2987.6319235481492,"Oncorhynchus","",3312.0824262524493,"Ceriodaphnia","",7770.4797554555653,null,"Salmo","",434.41001855057362,"Salvelinus","",638.17632596029205,"Daphnia","",985.25892001760678,"Lampsilis","",1026.1097707747783]
[null,"Site 182",1,100,7,7542.8737034161522,1960.7253936241273,980,380," ","Daphnia","",2324.837284676019,"Micropterus","",2987.6319235481492,"Oncorhynchus","",3312.0824262524493,"Ceriodaphnia","",7770.4797554555653,null,"Salmo","",434.41001855057362,"Salvelinus","",638.17632596029205,"Daphnia","",985.25892001760678,"Lampsilis","",1026.1097707747783]
[null,"Site 183",1,100,7,7542.8737034161522,1960.7253936241273,980,380," ","Daphnia","",2324.837284676019,"Micropterus","",2987.6319235481492,"Oncorhynchus","",3312.0824262524493,"Ceriodaphnia","",7770.4797554555653,null,"Salmo","",434.41001855057362,"Salvelinus","",638.17632596029205,"Daphnia","",985.25892001760678,"Lampsilis","",1026.1097707747783]
[null,"Site 184",1,100,7,7542.8737034161522,1960.7253936241273,980,380," ","Daphnia","",2324.837284676019,"Micropterus","",2987.6319235481492,"Oncorhynchus","",3312.0824262524493,"Ceriodaphnia","",7770.4797554555653,null,"Salmo","",434.41001855057362,"Salvelinus","",638.17632596029205,"Daphnia","",985.25892001760678,"Lampsilis","",1026.1097707747783]
[null,"Site 185",1,100,7,7542.8737034161522,1960.7253936241273,980,380," ","Daphnia","",2324.837284676019,"Micropterus","",2987.6319235481492,"Oncorhynchus","",3312.0824262524493,"Ceriodaphnia","",7770.4797554555653,null,"Salmo","",434.41001855057362,"Salvelinus","",638.17632596029205,"Daphnia","",985.25892001760678,"Lampsilis","",1026.1097707747783]
[null,"Site 186",1,100,7,7542.8737034161522,1960.7253936241273,980,380," ","Daphnia","",2324.837284676019,"Micropterus","",2987.6319235481492,"Oncorhynchus","",3312.0824262524493,"Ceriodaphnia","",7770.4797554555653,null,"Salmo","",434.41001855057362,"Salvelinus","",638.17632596029205,"Daphnia","",985.25892001760678,"Lampsilis","",1026.1097707747783]
[null,"Site 187",1,100,7,7542.8737034161522,1960.7253936241273,980,380," ","Daphnia","",2324.837284676019,"Micropterus","",2987.6319235481492,"Oncorhynchus","",3312.0824262524493,"Ceriodaphnia","",7770.4797554555653,null,"Salmo","",434.41001855057362,"Salvelinus","",638.17632596029205,"Daphnia","",985.25892001760678,"Lampsilis","",1026.1097707747783]
[null,"Site 188",1,100,7,7542.8737034161522,1960.7253936241273,980,380," ","Daphnia","",2324.837284676019,"Micropterus","",2987.6319235481492,"Oncorhynchus","",3312.0824262524493,"Ceriodaphnia","",7770.4797554555653,null,"Salmo","",434.41001855057362,"Salvelinus","",638.17632596029205,"Daphnia","",985.25892001760678,"Lampsilis","",1026.1097707747783]
[null,"Site 189",1,100,7,7542.8737034161522,1960.7253936241273,980,380," ","Daphnia","",2324.837284676019,"Micropterus","",2987.6319235481492,"Oncorhynchus","",3312.0824262524493,"Ceriodaphnia","",7770.4797554555653,null,"Salmo","",434.41001855057362,"Salvelinus","",638.17632596029205,"Daphnia","",985.25892001760678,"Lampsilis","",1026.1097707747783]
[null,"Site 190",1,100,7,7542.8737034161522,1960.7253936241273,980,380," ","Daphnia","",2324.837284676019,"Micropterus","",2987.6319235481492,"Oncorhynchus","",3312.0824262524493,"Ceriodaphnia","",7770.4797554555653,null,"Salmo","",434.41001855057362,"Salvelinus","",638.17632596029205,"Daphnia","",985.25892001760678,"Lampsilis","",1026.1097707747783]
[null,"Site 191",1,100,7,7542.8737034161522,1960.7253936241273,980,380," ","Daphnia","",2324.837284676019,"Micropterus","",2987.6319235481492,"Oncorhynchus","",3312.0824262524493,"Ceriodaphnia","",7770.4797554555653,null,"Salmo","",434.41001855057362,"Salvelinus","",638.17632596029205,"Daphnia","",985.25892001760678,"Lampsilis","",1026.1097707747783]
[null,"Site 192",1,100,7,7542.8737034161522,1960.7253936241273,980,380," ","Daphnia","",2324.837284676019,"Micropterus","",2987.6319235481492,"Oncorhynchus","",3312.0824262524493,"Ceriodaphnia","",7770.4797554555653,null,"Salmo","",434.41001855057362,"Salvelinus","",638.17632596029205,"Daphnia","",985.25892001760678,"Lampsilis","",1026.1097707747783]
[null,"Site 193",1,100,7,7542.8737034161522,1960.7253936241273,980,380," ","Daphnia","",2324.837284676019,"Micropterus","",2987.6319235481492,"Oncorhynchus","",3312.0824262524493,"Ceriodaphnia","",7770.4797554555653,null,"Salmo","",434.41001855057362,"Salvelinus","",638.17632596029205,"Daphnia","",985.25892001760678,"Lampsilis","",1026.1097707747783]
[null,"Site 194",1,100,7,7542.8737034161522,1960.7253936241273,980,380,{"$f":"IF(OR(C203>12,D203>430,E203<6,E203>8.2),\"Outside model inputs\",\" \")","v":" "},"Daphnia","",2324.837284676019,"Micropterus","",2987.6319235481492,"Oncorhynchus","",3312.0824262524493,"Ceriodaphnia","",7770.4797554555653,null,"Salmo","",434.41001855057362,"Salvelinus","",638.17632596029205,"Daphnia","",985.25892001760678,"Lampsilis","",1026.1097707747783]
[null,"Site 195",1,100,7,7542.8737034161522,1960.7253936241273,980,380," ","Daphnia","",2324.837284676019,"Micropterus","",2987.6319235481492,"Oncorhynchus","",3312.0824262524493,"Ceriodaphnia","",7770.4797554555653,null,"Salmo","",434.41001855057362,"Salvelinus","",638.17632596029205,"Daphnia","",985.25892001760678,"Lampsilis","",1026.1097707747783]
[null,"Site 196",1,100,7,7542.8737034161522,1960.7253936241273,980,380," ","Daphnia","",2324.837284676019,"Micropterus","",2987.6319235481492,"Oncorhynchus","",3312.0824262524493,"Ceriodaphnia","",7770.4797554555653,null,"Salmo","",434.41001855057362,"Salvelinus","",638.17632596029205,"Daphnia","",985.25892001760678,"Lampsilis","",1026.1097707747783]
[null,"Site 197",1,100,7,7542.8737034161522,1960.7253936241273,980,380," ","Daphnia","",2324.837284676019,"Micropterus","",2987.6319235481492,"Oncorhynchus","",3312.0824262524493,"Ceriodaphnia","",7770.4797554555653,null,"Salmo","",434.41001855057362,"Salvelinus","",638.17632596029205,"Daphnia","",985.25892001760678,"Lampsilis","",1026.1097707747783]
[null,"Site 198",1,100,7,7542.8737034161522,1960.7253936241273,980,380," ","Daphnia","",2324.837284676019,"Micropterus","",2987.6319235481492,"Oncorhynchus","",3312.0824262524493,"Ceriodaphnia","",7770.4797554555653,null,"Salmo","",434.41001855057362,"Salvelinus","",638.17632596029205,"Daphnia","",985.25892001760678,"Lampsilis","",1026.1097707747783]
[null,"Site 199",1,100,7,7542.8737034161522,1960.7253936241273,980,380," ","Daphnia","",2324.837284676019,"Micropterus","",2987.6319235481492,"Oncorhynchus","",3312.0824262524493,"Ceriodaphnia","",7770.4797554555653,null,"Salmo","",434.41001855057362,"Salvelinus","",638.17632596029205,"Daphnia","",985.25892001760678,"Lampsilis","",1026.1097707747783]
[null,"Site 200",1,100,7,7542.8737034161522,1960.7253936241273,980,380," ","Daphnia","",2324.837284676019,"Micropterus","",2987.6319235481492,"Oncorhynchus","",3312.0824262524493,"Ceriodaphnia","",7770.4797554555653,null,"Salmo","",434.41001855057362,"Salvelinus","",638.17632596029205,"Daphnia","",985.25892001760678,"Lampsilis","",1026.1097707747783]
[null,"Site 201",1,100,7,7542.8737034161522,1960.7253936241273,980,380," ","Daphnia","",2324.837284676019,"Micropterus","",2987.6319235481492,"Oncorhynchus","",3312.0824262524493,"Ceriodaphnia","",7770.4797554555653,null,"Salmo","",434.41001855057362,"Salvelinus","",638.17632596029205,"Daphnia","",985.25892001760678,"Lampsilis","",1026.1097707747783]
[null,"Site 202",1,100,7,7542.8737034161522,1960.7253936241273,980,380," ","Daphnia","",2324.837284676019,"Micropterus","",2987.6319235481492,"Oncorhynchus","",3312.0824262524493,"Ceriodaphnia","",7770.4797554555653,null,"Salmo","",434.41001855057362,"Salvelinus","",638.17632596029205,"Daphnia","",985.25892001760678,"Lampsilis","",1026.1097707747783]
[null,"Site 203",1,100,7,7542.8737034161522,1960.7253936241273,980,380," ","Daphnia","",2324.837284676019,"Micropterus","",2987.6319235481492,"Oncorhynchus","",3312.0824262524493,"Ceriodaphnia","",7770.4797554555653,null,"Salmo","",434.41001855057362,"Salvelinus","",638.17632596029205,"Daphnia","",985.25892001760678,"Lampsilis","",1026.1097707747783]
[null,"Site 204",1,100,7,7542.8737034161522,1960.7253936241273,980,380," ","Daphnia","",2324.837284676019,"Micropterus","",2987.6319235481492,"Oncorhynchus","",3312.0824262524493,"Ceriodaphnia","",7770.4797554555653,null,"Salmo","",434.41001855057362,"Salvelinus","",638.17632596029205,"Daphnia","",985.25892001760678,"Lampsilis","",1026.1097707747783]
[null,"Site 205",1,100,7,7542.8737034161522,1960.7253936241273,980,380," ","Daphnia","",2324.837284676019,"Micropterus","",2987.6319235481492,"Oncorhynchus","",3312.0824262524493,"Ceriodaphnia","",7770.4797554555653,null,"Salmo","",434.41001855057362,"Salvelinus","",638.17632596029205,"Daphnia","",985.25892001760678,"Lampsilis","",1026.1097707747783]
[null,"Site 206",1,100,7,7542.8737034161522,1960.7253936241273,980,380," ","Daphnia","",2324.837284676019,"Micropterus","",2987.6319235481492,"Oncorhynchus","",3312.0824262524493,"Ceriodaphnia","",7770.4797554555653,null,"Salmo","",434.41001855057362,"Salvelinus","",638.17632596029205,"Daphnia","",985.25892001760678,"Lampsilis","",1026.1097707747783]
[null,"Site 207",1,100,7,7542.8737034161522,1960.7253936241273,980,380," ","Daphnia","",2324.837284676019,"Micropterus","",2987.6319235481492,"Oncorhynchus","",3312.0824262524493,"Ceriodaphnia","",7770.4797554555653,null,"Salmo","",434.41001855057362,"Salvelinus","",638.17632596029205,"Daphnia","",985.25892001760678,"Lampsilis","",1026.1097707747783]
[null,"Site 208",1,100,7,7542.8737034161522,1960.7253936241273,980,380," ","Daphnia","",2324.837284676019,"Micropterus","",2987.6319235481492,"Oncorhynchus","",3312.0824262524493,"Ceriodaphnia","",7770.4797554555653,null,"Salmo","",434.41001855057362,"Salvelinus","",638.17632596029205,"Daphnia","",985.25892001760678,"Lampsilis","",1026.1097707747783]
[null,"Site 209",1,100,7,7542.8737034161522,1960.7253936241273,980,380," ","Daphnia","",2324.837284676019,"Micropterus","",2987.6319235481492,"Oncorhynchus","",3312.0824262524493,"Ceriodaphnia","",7770.4797554555653,null,"Salmo","",434.41001855057362,"Salvelinus","",638.17632596029205,"Daphnia","",985.25892001760678,"Lampsilis","",1026.1097707747783]
[null,"Site 210",1,100,7,7542.8737034161522,1960.7253936241273,980,380," ","Daphnia","",2324.837284676019,"Micropterus","",2987.6319235481492,"Oncorhynchus","",3312.0824262524493,"Ceriodaphnia","",7770.4797554555653,null,"Salmo","",434.41001855057362,"Salvelinus","",638.17632596029205,"Daphnia","",985.25892001760678,"Lampsilis","",1026.1097707747783]
[null,"Site 211",1,100,7,7542.8737034161522,1960.7253936241273,980,380," ","Daphnia","",2324.837284676019,"Micropterus","",2987.6319235481492,"Oncorhynchus","",3312.0824262524493,"Ceriodaphnia","",7770.4797554555653,null,"Salmo","",434.41001855057362,"Salvelinus","",638.17632596029205,"Daphnia","",985.25892001760678,"Lampsilis","",1026.1097707747783]
[null,"Site 212",1,100,7,7542.8737034161522,1960.7253936241273,980,380," ","Daphnia","",2324.837284676019,"Micropterus","",2987.6319235481492,"Oncorhynchus","",3312.0824262524493,"Ceriodaphnia","",7770.4797554555653,null,"Salmo","",434.41001855057362,"Salvelinus","",638.17632596029205,"Daphnia","",985.25892001760678,"Lampsilis","",1026.1097707747783]
[null,"Site 213",1,100,7,7542.8737034161522,1960.7253936241273,980,380," ","Daphnia","",2324.837284676019,"Micropterus","",2987.6319235481492,"Oncorhynchus","",3312.0824262524493,"Ceriodaphnia","",7770.4797554555653,null,"Salmo","",434.41001855057362,"Salvelinus","",638.17632596029205,"Daphnia","",985.25892001760678,"Lampsilis","",1026.1097707747783]
[null,"Site 214",1,100,7,7542.8737034161522,1960.7253936241273,980,380," ","Daphnia","",2324.837284676019,"Micropterus","",2987.6319235481492,"Oncorhynchus","",3312.0824262524493,"Ceriodaphnia","",7770.4797554555653,null,"Salmo","",434.41001855057362,"Salvelinus","",638.17632596029205,"Daphnia","",985.25892001760678,"Lampsilis","",1026.1097707747783]
[null,"Site 215",1,100,7,7542.8737034161522,1960.7253936241273,980,380," ","Daphnia","",2324.837284676019,"Micropterus","",2987.6319235481492,"Oncorhynchus","",3312.0824262524493,"Ceriodaphnia","",7770.4797554555653,null,"Salmo","",434.41001855057362,"Salvelinus","",638.17632596029205,"Daphnia","",985.25892001760678,"Lampsilis","",1026.1097707747783]
[null,"Site 216",1,100,7,7542.8737034161522,1960.7253936241273,980,380," ","Daphnia","",2324.837284676019,"Micropterus","",2987.6319235481492,"Oncorhynchus","",3312.0824262524493,"Ceriodaphnia","",7770.4797554555653,null,"Salmo","",434.41001855057362,"Salvelinus","",638.17632596029205,"Daphnia","",985.25892001760678,"Lampsilis","",1026.1097707747783]
[null,"Site 217",1,100,7,7542.8737034161522,1960.7253936241273,980,380," ","Daphnia","",2324.837284676019,"Micropterus","",2987.6319235481492,"Oncorhynchus","",3312.0824262524493,"Ceriodaphnia","",7770.4797554555653,null,"Salmo","",434.41001855057362,"Salvelinus","",638.17632596029205,"Daphnia","",985.25892001760678,"Lampsilis","",1026.1097707747783]
[null,"Site 218",1,100,7,7542.8737034161522,1960.7253936241273,980,380," ","Daphnia","",2324.837284676019,"Micropterus","",2987.6319235481492,"Oncorhynchus","",3312.0824262524493,"Ceriodaphnia","",7770.4797554555653,null,"Salmo","",434.41001855057362,"Salvelinus","",638.17632596029205,"Daphnia","",985.25892001760678,"Lampsilis","",1026.1097707747783]
[null,"Site 219",1,100,7,7542.8737034161522,1960.7253936241273,980,380," ","Daphnia","",2324.837284676019,"Micropterus","",2987.6319235481492,"Oncorhynchus","",3312.0824262524493,"Ceriodaphnia","",7770.4797554555653,null,"Salmo","",434.41001855057362,"Salvelinus","",638.17632596029205,"Daphnia","",985.25892001760678,"Lampsilis","",1026.1097707747783]
[null,"Site 220",1,100,7,7542.8737034161522,1960.7253936241273,980,380," ","Daphnia","",2324.837284676019,"Micropterus","",2987.6319235481492,"Oncorhynchus","",3312.0824262524493,"Ceriodaphnia","",7770.4797554555653,null,"Salmo","",434.41001855057362,"Salvelinus","",638.17632596029205,"Daphnia","",985.25892001760678,"Lampsilis","",1026.1097707747783]
[null,"Site 221",1,100,7,7542.8737034161522,1960.7253936241273,980,380," ","Daphnia","",2324.837284676019,"Micropterus","",2987.6319235481492,"Oncorhynchus","",3312.0824262524493,"Ceriodaphnia","",7770.4797554555653,null,"Salmo","",434.41001855057362,"Salvelinus","",638.17632596029205,"Daphnia","",985.25892001760678,"Lampsilis","",1026.1097707747783]
[null,"Site 222",1,100,7,7542.8737034161522,1960.7253936241273,980,380," ","Daphnia","",2324.837284676019,"Micropterus","",2987.6319235481492,"Oncorhynchus","",3312.0824262524493,"Ceriodaphnia","",7770.4797554555653,null,"Salmo","",434.41001855057362,"Salvelinus","",638.17632596029205,"Daphnia","",985.25892001760678,"Lampsilis","",1026.1097707747783]
[null,"Site 223",1,100,7,7542.8737034161522,1960.7253936241273,980,380," ","Daphnia","",2324.837284676019,"Micropterus","",2987.6319235481492,"Oncorhynchus","",3312.0824262524493,"Ceriodaphnia","",7770.4797554555653,null,"Salmo","",434.41001855057362,"Salvelinus","",638.17632596029205,"Daphnia","",985.25892001760678,"Lampsilis","",1026.1097707747783]
[null,"Site 224",1,100,7,7542.8737034161522,1960.7253936241273,980,380," ","Daphnia","",2324.837284676019,"Micropterus","",2987.6319235481492,"Oncorhynchus","",3312.0824262524493,"Ceriodaphnia","",7770.4797554555653,null,"Salmo","",434.41001855057362,"Salvelinus","",638.17632596029205,"Daphnia","",985.25892001760678,"Lampsilis","",1026.1097707747783]
[null,"Site 225",1,100,7,7542.8737034161522,1960.7253936241273,980,380," ","Daphnia","",2324.837284676019,"Micropterus","",2987.6319235481492,"Oncorhynchus","",3312.0824262524493,"Ceriodaphnia","",7770.4797554555653,null,"Salmo","",434.41001855057362,"Salvelinus","",638.17632596029205,"Daphnia","",985.25892001760678,"Lampsilis","",1026.1097707747783]
[null,"Site 226",1,100,7,7542.8737034161522,1960.7253936241273,980,380," ","Daphnia","",2324.837284676019,"Micropterus","",2987.6319235481492,"Oncorhynchus","",3312.0824262524493,"Ceriodaphnia","",7770.4797554555653,null,"Salmo","",434.41001855057362,"Salvelinus","",638.17632596029205,"Daphnia","",985.25892001760678,"Lampsilis","",1026.1097707747783]
[null,"Site 227",1,100,7,7542.8737034161522,1960.7253936241273,980,380," ","Daphnia","",2324.837284676019,"Micropterus","",2987.6319235481492,"Oncorhynchus","",3312.0824262524493,"Ceriodaphnia","",7770.4797554555653,null,"Salmo","",434.41001855057362,"Salvelinus","",638.17632596029205,"Daphnia","",985.25892001760678,"Lampsilis","",1026.1097707747783]
[null,"Site 228",1,100,7,7542.8737034161522,1960.7253936241273,980,380," ","Daphnia","",2324.837284676019,"Micropterus","",2987.6319235481492,"Oncorhynchus","",3312.0824262524493,"Ceriodaphnia","",7770.4797554555653,null,"Salmo","",434.41001855057362,"Salvelinus","",638.17632596029205,"Daphnia","",985.25892001760678,"Lampsilis","",1026.1097707747783]
[null,"Site 229",1,100,7,7542.8737034161522,1960.7253936241273,980,380," ","Daphnia","",2324.837284676019,"Micropterus","",2987.6319235481492,"Oncorhynchus","",3312.0824262524493,"Ceriodaphnia","",7770.4797554555653,null,"Salmo","",434.41001855057362,"Salvelinus","",638.17632596029205,"Daphnia","",985.25892001760678,"Lampsilis","",1026.1097707747783]
[null,"Site 230",1,100,7,7542.8737034161522,1960.7253936241273,980,380," ","Daphnia","",2324.837284676019,"Micropterus","",2987.6319235481492,"Oncorhynchus","",3312.0824262524493,"Ceriodaphnia","",7770.4797554555653,null,"Salmo","",434.41001855057362,"Salvelinus","",638.17632596029205,"Daphnia","",985.25892001760678,"Lampsilis","",1026.1097707747783]
[null,"Site 231",1,100,7,7542.8737034161522,1960.7253936241273,980,380," ","Daphnia","",2324.837284676019,"Micropterus","",2987.6319235481492,"Oncorhynchus","",3312.0824262524493,"Ceriodaphnia","",7770.4797554555653,null,"Salmo","",434.41001855057362,"Salvelinus","",638.17632596029205,"Daphnia","",985.25892001760678,"Lampsilis","",1026.1097707747783]
[null,"Site 232",1,100,7,7542.8737034161522,1960.7253936241273,980,380," ","Daphnia","",2324.837284676019,"Micropterus","",2987.6319235481492,"Oncorhynchus","",3312.0824262524493,"Ceriodaphnia","",7770.4797554555653,null,"Salmo","",434.41001855057362,"Salvelinus","",638.17632596029205,"Daphnia","",985.25892001760678,"Lampsilis","",1026.1097707747783]
[null,"Site 233",1,100,7,7542.8737034161522,1960.7253936241273,980,380," ","Daphnia","",2324.837284676019,"Micropterus","",2987.6319235481492,"Oncorhynchus","",3312.0824262524493,"Ceriodaphnia","",7770.4797554555653,null,"Salmo","",434.41001855057362,"Salvelinus","",638.17632596029205,"Daphnia","",985.25892001760678,"Lampsilis","",1026.1097707747783]
[null,"Site 234",1,100,7,7542.8737034161522,1960.7253936241273,980,380," ","Daphnia","",2324.837284676019,"Micropterus","",2987.6319235481492,"Oncorhynchus","",3312.0824262524493,"Ceriodaphnia","",7770.4797554555653,null,"Salmo","",434.41001855057362,"Salvelinus","",638.17632596029205,"Daphnia","",985.25892001760678,"Lampsilis","",1026.1097707747783]
[null,"Site 235",1,100,7,7542.8737034161522,1960.7253936241273,980,380," ","Daphnia","",2324.837284676019,"Micropterus","",2987.6319235481492,"Oncorhynchus","",3312.0824262524493,"Ceriodaphnia","",7770.4797554555653,null,"Salmo","",434.41001855057362,"Salvelinus","",638.17632596029205,"Daphnia","",985.25892001760678,"Lampsilis","",1026.1097707747783]
[null,"Site 236",1,100,7,7542.8737034161522,1960.7253936241273,980,380," ","Daphnia","",2324.837284676019,"Micropterus","",2987.6319235481492,"Oncorhynchus","",3312.0824262524493,"Ceriodaphnia","",7770.4797554555653,null,"Salmo","",434.41001855057362,"Salvelinus","",638.17632596029205,"Daphnia","",985.25892001760678,"Lampsilis","",1026.1097707747783]
[null,"Site 237",1,100,7,7542.8737034161522,1960.7253936241273,980,380," ","Daphnia","",2324.837284676019,"Micropterus","",2987.6319235481492,"Oncorhynchus","",3312.0824262524493,"Ceriodaphnia","",7770.4797554555653,null,"Salmo","",434.41001855057362,"Salvelinus","",638.17632596029205,"Daphnia","",985.25892001760678,"Lampsilis","",1026.1097707747783]
[null,"Site 238",1,100,7,7542.8737034161522,1960.7253936241273,980,380," ","Daphnia","",2324.837284676019,"Micropterus","",2987.6319235481492,"Oncorhynchus","",3312.0824262524493,"Ceriodaphnia","",7770.4797554555653,null,"Salmo","",434.41001855057362,"Salvelinus","",638.17632596029205,"Daphnia","",985.25892001760678,"Lampsilis","",1026.1097707747783]
[null,"Site 239",1,100,7,7542.8737034161522,1960.7253936241273,980,380," ","Daphnia","",2324.837284676019,"Micropterus","",2987.6319235481492,"Oncorhynchus","",3312.0824262524493,"Ceriodaphnia","",7770.4797554555653,null,"Salmo","",434.41001855057362,"Salvelinus","",638.17632596029205,"Daphnia","",985.25892001760678,"Lampsilis","",1026.1097707747783]
[null,"Site 240",1,100,7,7542.8737034161522,1960.7253936241273,980,380," ","Daphnia","",2324.837284676019,"Micropterus","",2987.6319235481492,"Oncorhynchus","",3312.0824262524493,"Ceriodaphnia","",7770.4797554555653,null,"Salmo","",434.41001855057362,"Salvelinus","",638.17632596029205,"Daphnia","",985.25892001760678,"Lampsilis","",1026.1097707747783]
[null,"Site 241",1,100,7,7542.8737034161522,1960.7253936241273,980,380," ","Daphnia","",2324.837284676019,"Micropterus","",2987.6319235481492,"Oncorhynchus","",3312.0824262524493,"Ceriodaphnia","",7770.4797554555653,null,"Salmo","",434.41001855057362,"Salvelinus","",638.17632596029205,"Daphnia","",985.25892001760678,"Lampsilis","",1026.1097707747783]
[null,"Site 242",1,100,7,7542.8737034161522,1960.7253936241273,980,380," ","Daphnia","",2324.837284676019,"Micropterus","",2987.6319235481492,"Oncorhynchus","",3312.0824262524493,"Ceriodaphnia","",7770.4797554555653,null,"Salmo","",434.41001855057362,"Salvelinus","",638.17632596029205,"Daphnia","",985.25892001760678,"Lampsilis","",1026.1097707747783]
[null,"Site 243",1,100,7,7542.8737034161522,1960.7253936241273,980,380," ","Daphnia","",2324.837284676019,"Micropterus","",2987.6319235481492,"Oncorhynchus","",3312.0824262524493,"Ceriodaphnia","",7770.4797554555653,null,"Salmo","",434.41001855057362,"Salvelinus","",638.17632596029205,"Daphnia","",985.25892001760678,"Lampsilis","",1026.1097707747783]
[null,"Site 244",1,100,7,7542.8737034161522,1960.7253936241273,980,380," ","Daphnia","",2324.837284676019,"Micropterus","",2987.6319235481492,"Oncorhynchus","",3312.0824262524493,"Ceriodaphnia","",7770.4797554555653,null,"Salmo","",434.41001855057362,"Salvelinus","",638.17632596029205,"Daphnia","",985.25892001760678,"Lampsilis","",1026.1097707747783]
[null,"Site 245",1,100,7,7542.8737034161522,1960.7253936241273,980,380," ","Daphnia","",2324.837284676019,"Micropterus","",2987.6319235481492,"Oncorhynchus","",3312.0824262524493,"Ceriodaphnia","",7770.4797554555653,null,"Salmo","",434.41001855057362,"Salvelinus","",638.17632596029205,"Daphnia","",985.25892001760678,"Lampsilis","",1026.1097707747783]
[null,"Site 246",1,100,7,7542.8737034161522,1960.7253936241273,980,380," ","Daphnia","",2324.837284676019,"Micropterus","",2987.6319235481492,"Oncorhynchus","",3312.0824262524493,"Ceriodaphnia","",7770.4797554555653,null,"Salmo","",434.41001855057362,"Salvelinus","",638.17632596029205,"Daphnia","",985.25892001760678,"Lampsilis","",1026.1097707747783]
[null,"Site 247",1,100,7,7542.8737034161522,1960.7253936241273,980,380," ","Daphnia","",2324.837284676019,"Micropterus","",2987.6319235481492,"Oncorhynchus","",3312.0824262524493,"Ceriodaphnia","",7770.4797554555653,null,"Salmo","",434.41001855057362,"Salvelinus","",638.17632596029205,"Daphnia","",985.25892001760678,"Lampsilis","",1026.1097707747783]
[null,"Site 248",1,100,7,7542.8737034161522,1960.7253936241273,980,380," ","Daphnia","",2324.837284676019,"Micropterus","",2987.6319235481492,"Oncorhynchus","",3312.0824262524493,"Ceriodaphnia","",7770.4797554555653,null,"Salmo","",434.41001855057362,"Salvelinus","",638.17632596029205,"Daphnia","",985.25892001760678,"Lampsilis","",1026.1097707747783]
[null,"Site 249",1,100,7,7542.8737034161522,1960.7253936241273,980,380," ","Daphnia","",2324.837284676019,"Micropterus","",2987.6319235481492,"Oncorhynchus","",3312.0824262524493,"Ceriodaphnia","",7770.4797554555653,null,"Salmo","",434.41001855057362,"Salvelinus","",638.17632596029205,"Daphnia","",985.25892001760678,"Lampsilis","",1026.1097707747783]
[null,"Site 250",1,100,7,7542.8737034161522,1960.7253936241273,980,380," ","Daphnia","",2324.837284676019,"Micropterus","",2987.6319235481492,"Oncorhynchus","",3312.0824262524493,"Ceriodaphnia","",7770.4797554555653,null,"Salmo","",434.41001855057362,"Salvelinus","",638.17632596029205,"Daphnia","",985.25892001760678,"Lampsilis","",1026.1097707747783]
[null,"Site 251",1,100,7,7542.8737034161522,1960.7253936241273,980,380," ","Daphnia","",2324.837284676019,"Micropterus","",2987.6319235481492,"Oncorhynchus","",3312.0824262524493,"Ceriodaphnia","",7770.4797554555653,null,"Salmo","",434.41001855057362,"Salvelinus","",638.17632596029205,"Daphnia","",985.25892001760678,"Lampsilis","",1026.1097707747783]
[null,"Site 252",1,100,7,7542.8737034161522,1960.7253936241273,980,380," ","Daphnia","",2324.837284676019,"Micropterus","",2987.6319235481492,"Oncorhynchus","",3312.0824262524493,"Ceriodaphnia","",7770.4797554555653,null,"Salmo","",434.41001855057362,"Salvelinus","",638.17632596029205,"Daphnia","",985.25892001760678,"Lampsilis","",1026.1097707747783]
[null,"Site 253",1,100,7,7542.8737034161522,1960.7253936241273,980,380," ","Daphnia","",2324.837284676019,"Micropterus","",2987.6319235481492,"Oncorhynchus","",3312.0824262524493,"Ceriodaphnia","",7770.4797554555653,null,"Salmo","",434.41001855057362,"Salvelinus","",638.17632596029205,"Daphnia","",985.25892001760678,"Lampsilis","",1026.1097707747783]
[null,"Site 254",1,100,7,7542.8737034161522,1960.7253936241273,980,380," ","Daphnia","",2324.837284676019,"Micropterus","",2987.6319235481492,"Oncorhynchus","",3312.0824262524493,"Ceriodaphnia","",7770.4797554555653,null,"Salmo","",434.41001855057362,"Salvelinus","",638.17632596029205,"Daphnia","",985.25892001760678,"Lampsilis","",1026.1097707747783]
[null,"Site 255",1,100,7,7542.8737034161522,1960.7253936241273,980,380," ","Daphnia","",2324.837284676019,"Micropterus","",2987.6319235481492,"Oncorhynchus","",3312.0824262524493,"Ceriodaphnia","",7770.4797554555653,null,"Salmo","",434.41001855057362,"Salvelinus","",638.17632596029205,"Daphnia","",985.25892001760678,"Lampsilis","",1026.1097707747783]
[null,"Site 256",1,100,7,7542.8737034161522,1960.7253936241273,980,380," ","Daphnia","",2324.837284676019,"Micropterus","",2987.6319235481492,"Oncorhynchus","",3312.0824262524493,"Ceriodaphnia","",7770.4797554555653,null,"Salmo","",434.41001855057362,"Salvelinus","",638.17632596029205,"Daphnia","",985.25892001760678,"Lampsilis","",1026.1097707747783]
[null,"Site 257",1,100,7,7542.8737034161522,1960.7253936241273,980,380," ","Daphnia","",2324.837284676019,"Micropterus","",2987.6319235481492,"Oncorhynchus","",3312.0824262524493,"Ceriodaphnia","",7770.4797554555653,null,"Salmo","",434.41001855057362,"Salvelinus","",638.17632596029205,"Daphnia","",985.25892001760678,"Lampsilis","",1026.1097707747783]
[null,"Site 258",1,100,7,7542.8737034161522,1960.7253936241273,980,380,{"$f":"IF(OR(C267>12,D267>430,E267<6,E267>8.2),\"Outside model inputs\",\" \")","v":" "},"Daphnia","",2324.837284676019,"Micropterus","",2987.6319235481492,"Oncorhynchus","",3312.0824262524493,"Ceriodaphnia","",7770.4797554555653,null,"Salmo","",434.41001855057362,"Salvelinus","",638.17632596029205,"Daphnia","",985.25892001760678,"Lampsilis","",1026.1097707747783]
[null,"Site 259",1,100,7,7542.8737034161522,1960.7253936241273,980,380," ","Daphnia","",2324.837284676019,"Micropterus","",2987.6319235481492,"Oncorhynchus","",3312.0824262524493,"Ceriodaphnia","",7770.4797554555653,null,"Salmo","",434.41001855057362,"Salvelinus","",638.17632596029205,"Daphnia","",985.25892001760678,"Lampsilis","",1026.1097707747783]
[null,"Site 260",1,100,7,7542.8737034161522,1960.7253936241273,980,380," ","Daphnia","",2324.837284676019,"Micropterus","",2987.6319235481492,"Oncorhynchus","",3312.0824262524493,"Ceriodaphnia","",7770.4797554555653,null,"Salmo","",434.41001855057362,"Salvelinus","",638.17632596029205,"Daphnia","",985.25892001760678,"Lampsilis","",1026.1097707747783]
[null,"Site 261",1,100,7,7542.8737034161522,1960.7253936241273,980,380," ","Daphnia","",2324.837284676019,"Micropterus","",2987.6319235481492,"Oncorhynchus","",3312.0824262524493,"Ceriodaphnia","",7770.4797554555653,null,"Salmo","",434.41001855057362,"Salvelinus","",638.17632596029205,"Daphnia","",985.25892001760678,"Lampsilis","",1026.1097707747783]
[null,"Site 262",1,100,7,7542.8737034161522,1960.7253936241273,980,380," ","Daphnia","",2324.837284676019,"Micropterus","",2987.6319235481492,"Oncorhynchus","",3312.0824262524493,"Ceriodaphnia","",7770.4797554555653,null,"Salmo","",434.41001855057362,"Salvelinus","",638.17632596029205,"Daphnia","",985.25892001760678,"Lampsilis","",1026.1097707747783]
[null,"Site 263",1,100,7,7542.8737034161522,1960.7253936241273,980,380," ","Daphnia","",2324.837284676019,"Micropterus","",2987.6319235481492,"Oncorhynchus","",3312.0824262524493,"Ceriodaphnia","",7770.4797554555653,null,"Salmo","",434.41001855057362,"Salvelinus","",638.17632596029205,"Daphnia","",985.25892001760678,"Lampsilis","",1026.1097707747783]
[null,"Site 264",1,100,7,7542.8737034161522,1960.7253936241273,980,380," ","Daphnia","",2324.837284676019,"Micropterus","",2987.6319235481492,"Oncorhynchus","",3312.0824262524493,"Ceriodaphnia","",7770.4797554555653,null,"Salmo","",434.41001855057362,"Salvelinus","",638.17632596029205,"Daphnia","",985.25892001760678,"Lampsilis","",1026.1097707747783]
[null,"Site 265",1,100,7,7542.8737034161522,1960.7253936241273,980,380," ","Daphnia","",2324.837284676019,"Micropterus","",2987.6319235481492,"Oncorhynchus","",3312.0824262524493,"Ceriodaphnia","",7770.4797554555653,null,"Salmo","",434.41001855057362,"Salvelinus","",638.17632596029205,"Daphnia","",985.25892001760678,"Lampsilis","",1026.1097707747783]
[null,"Site 266",1,100,7,7542.8737034161522,1960.7253936241273,980,380," ","Daphnia","",2324.837284676019,"Micropterus","",2987.6319235481492,"Oncorhynchus","",3312.0824262524493,"Ceriodaphnia","",7770.4797554555653,null,"Salmo","",434.41001855057362,"Salvelinus","",638.17632596029205,"Daphnia","",985.25892001760678,"Lampsilis","",1026.1097707747783]
[null,"Site 267",1,100,7,7542.8737034161522,1960.7253936241273,980,380," ","Daphnia","",2324.837284676019,"Micropterus","",2987.6319235481492,"Oncorhynchus","",3312.0824262524493,"Ceriodaphnia","",7770.4797554555653,null,"Salmo","",434.41001855057362,"Salvelinus","",638.17632596029205,"Daphnia","",985.25892001760678,"Lampsilis","",1026.1097707747783]
[null,"Site 268",1,100,7,7542.8737034161522,1960.7253936241273,980,380," ","Daphnia","",2324.837284676019,"Micropterus","",2987.6319235481492,"Oncorhynchus","",3312.0824262524493,"Ceriodaphnia","",7770.4797554555653,null,"Salmo","",434.41001855057362,"Salvelinus","",638.17632596029205,"Daphnia","",985.25892001760678,"Lampsilis","",1026.1097707747783]
[null,"Site 269",1,100,7,7542.8737034161522,1960.7253936241273,980,380," ","Daphnia","",2324.837284676019,"Micropterus","",2987.6319235481492,"Oncorhynchus","",3312.0824262524493,"Ceriodaphnia","",7770.4797554555653,null,"Salmo","",434.41001855057362,"Salvelinus","",638.17632596029205,"Daphnia","",985.25892001760678,"Lampsilis","",1026.1097707747783]
[null,"Site 270",1,100,7,7542.8737034161522,1960.7253936241273,980,380," ","Daphnia","",2324.837284676019,"Micropterus","",2987.6319235481492,"Oncorhynchus","",3312.0824262524493,"Ceriodaphnia","",7770.4797554555653,null,"Salmo","",434.41001855057362,"Salvelinus","",638.17632596029205,"Daphnia","",985.25892001760678,"Lampsilis","",1026.1097707747783]
[null,"Site 271",1,100,7,7542.8737034161522,1960.7253936241273,980,380," ","Daphnia","",2324.837284676019,"Micropterus","",2987.6319235481492,"Oncorhynchus","",3312.0824262524493,"Ceriodaphnia","",7770.4797554555653,null,"Salmo","",434.41001855057362,"Salvelinus","",638.17632596029205,"Daphnia","",985.25892001760678,"Lampsilis","",1026.1097707747783]
[null,"Site 272",1,100,7,7542.8737034161522,1960.7253936241273,980,380," ","Daphnia","",2324.837284676019,"Micropterus","",2987.6319235481492,"Oncorhynchus","",3312.0824262524493,"Ceriodaphnia","",7770.4797554555653,null,"Salmo","",434.41001855057362,"Salvelinus","",638.17632596029205,"Daphnia","",985.25892001760678,"Lampsilis","",1026.1097707747783]
[null,"Site 273",1,100,7,7542.8737034161522,1960.7253936241273,980,380," ","Daphnia","",2324.837284676019,"Micropterus","",2987.6319235481492,"Oncorhynchus","",3312.0824262524493,"Ceriodaphnia","",7770.4797554555653,null,"Salmo","",434.41001855057362,"Salvelinus","",638.17632596029205,"Daphnia","",985.25892001760678,"Lampsilis","",1026.1097707747783]
[null,"Site 274",1,100,7,7542.8737034161522,1960.7253936241273,980,380," ","Daphnia","",2324.837284676019,"Micropterus","",2987.6319235481492,"Oncorhynchus","",3312.0824262524493,"Ceriodaphnia","",7770.4797554555653,null,"Salmo","",434.41001855057362,"Salvelinus","",638.17632596029205,"Daphnia","",985.25892001760678,"Lampsilis","",1026.1097707747783]
[null,"Site 275",1,100,7,7542.8737034161522,1960.7253936241273,980,380," ","Daphnia","",2324.837284676019,"Micropterus","",2987.6319235481492,"Oncorhynchus","",3312.0824262524493,"Ceriodaphnia","",7770.4797554555653,null,"Salmo","",434.41001855057362,"Salvelinus","",638.17632596029205,"Daphnia","",985.25892001760678,"Lampsilis","",1026.1097707747783]
[null,"Site 276",1,100,7,7542.8737034161522,1960.7253936241273,980,380," ","Daphnia","",2324.837284676019,"Micropterus","",2987.6319235481492,"Oncorhynchus","",3312.0824262524493,"Ceriodaphnia","",7770.4797554555653,null,"Salmo","",434.41001855057362,"Salvelinus","",638.17632596029205,"Daphnia","",985.25892001760678,"Lampsilis","",1026.1097707747783]
[null,"Site 277",1,100,7,7542.8737034161522,1960.7253936241273,980,380," ","Daphnia","",2324.837284676019,"Micropterus","",2987.6319235481492,"Oncorhynchus","",3312.0824262524493,"Ceriodaphnia","",7770.4797554555653,null,"Salmo","",434.41001855057362,"Salvelinus","",638.17632596029205,"Daphnia","",985.25892001760678,"Lampsilis","",1026.1097707747783]
[null,"Site 278",1,100,7,7542.8737034161522,1960.7253936241273,980,380," ","Daphnia","",2324.837284676019,"Micropterus","",2987.6319235481492,"Oncorhynchus","",3312.0824262524493,"Ceriodaphnia","",7770.4797554555653,null,"Salmo","",434.41001855057362,"Salvelinus","",638.17632596029205,"Daphnia","",985.25892001760678,"Lampsilis","",1026.1097707747783]
[null,"Site 279",1,100,7,7542.8737034161522,1960.7253936241273,980,380," ","Daphnia","",2324.837284676019,"Micropterus","",2987.6319235481492,"Oncorhynchus","",3312.0824262524493,"Ceriodaphnia","",7770.4797554555653,null,"Salmo","",434.41001855057362,"Salvelinus","",638.17632596029205,"Daphnia","",985.25892001760678,"Lampsilis","",1026.1097707747783]
[null,"Site 280",1,100,7,7542.8737034161522,1960.7253936241273,980,380," ","Daphnia","",2324.837284676019,"Micropterus","",2987.6319235481492,"Oncorhynchus","",3312.0824262524493,"Ceriodaphnia","",7770.4797554555653,null,"Salmo","",434.41001855057362,"Salvelinus","",638.17632596029205,"Daphnia","",985.25892001760678,"Lampsilis","",1026.1097707747783]
[null,"Site 281",1,100,7,7542.8737034161522,1960.7253936241273,980,380," ","Daphnia","",2324.837284676019,"Micropterus","",2987.6319235481492,"Oncorhynchus","",3312.0824262524493,"Ceriodaphnia","",7770.4797554555653,null,"Salmo","",434.41001855057362,"Salvelinus","",638.17632596029205,"Daphnia","",985.25892001760678,"Lampsilis","",1026.1097707747783]
[null,"Site 282",1,100,7,7542.8737034161522,1960.7253936241273,980,380," ","Daphnia","",2324.837284676019,"Micropterus","",2987.6319235481492,"Oncorhynchus","",3312.0824262524493,"Ceriodaphnia","",7770.4797554555653,null,"Salmo","",434.41001855057362,"Salvelinus","",638.17632596029205,"Daphnia","",985.25892001760678,"Lampsilis","",1026.1097707747783]
[null,"Site 283",1,100,7,7542.8737034161522,1960.7253936241273,980,380," ","Daphnia","",2324.837284676019,"Micropterus","",2987.6319235481492,"Oncorhynchus","",3312.0824262524493,"Ceriodaphnia","",7770.4797554555653,null,"Salmo","",434.41001855057362,"Salvelinus","",638.17632596029205,"Daphnia","",985.25892001760678,"Lampsilis","",1026.1097707747783]
[null,"Site 284",1,100,7,7542.8737034161522,1960.7253936241273,980,380," ","Daphnia","",2324.837284676019,"Micropterus","",2987.6319235481492,"Oncorhynchus","",3312.0824262524493,"Ceriodaphnia","",7770.4797554555653,null,"Salmo","",434.41001855057362,"Salvelinus","",638.17632596029205,"Daphnia","",985.25892001760678,"Lampsilis","",1026.1097707747783]
[null,"Site 285",1,100,7,7542.8737034161522,1960.7253936241273,980,380," ","Daphnia","",2324.837284676019,"Micropterus","",2987.6319235481492,"Oncorhynchus","",3312.0824262524493,"Ceriodaphnia","",7770.4797554555653,null,"Salmo","",434.41001855057362,"Salvelinus","",638.17632596029205,"Daphnia","",985.25892001760678,"Lampsilis","",1026.1097707747783]
[null,"Site 286",1,100,7,7542.8737034161522,1960.7253936241273,980,380," ","Daphnia","",2324.837284676019,"Micropterus","",2987.6319235481492,"Oncorhynchus","",3312.0824262524493,"Ceriodaphnia","",7770.4797554555653,null,"Salmo","",434.41001855057362,"Salvelinus","",638.17632596029205,"Daphnia","",985.25892001760678,"Lampsilis","",1026.1097707747783]
[null,"Site 287",1,100,7,7542.8737034161522,1960.7253936241273,980,380," ","Daphnia","",2324.837284676019,"Micropterus","",2987.6319235481492,"Oncorhynchus","",3312.0824262524493,"Ceriodaphnia","",7770.4797554555653,null,"Salmo","",434.41001855057362,"Salvelinus","",638.17632596029205,"Daphnia","",985.25892001760678,"Lampsilis","",1026.1097707747783]
[null,"Site 288",1,100,7,7542.8737034161522,1960.7253936241273,980,380," ","Daphnia","",2324.837284676019,"Micropterus","",2987.6319235481492,"Oncorhynchus","",3312.0824262524493,"Ceriodaphnia","",7770.4797554555653,null,"Salmo","",434.41001855057362,"Salvelinus","",638.17632596029205,"Daphnia","",985.25892001760678,"Lampsilis","",1026.1097707747783]
[null,"Site 289",1,100,7,7542.8737034161522,1960.7253936241273,980,380," ","Daphnia","",2324.837284676019,"Micropterus","",2987.6319235481492,"Oncorhynchus","",3312.0824262524493,"Ceriodaphnia","",7770.4797554555653,null,"Salmo","",434.41001855057362,"Salvelinus","",638.17632596029205,"Daphnia","",985.25892001760678,"Lampsilis","",1026.1097707747783]
[null,"Site 290",1,100,7,7542.8737034161522,1960.7253936241273,980,380," ","Daphnia","",2324.837284676019,"Micropterus","",2987.6319235481492,"Oncorhynchus","",3312.0824262524493,"Ceriodaphnia","",7770.4797554555653,null,"Salmo","",434.41001855057362,"Salvelinus","",638.17632596029205,"Daphnia","",985.25892001760678,"Lampsilis","",1026.1097707747783]
[null,"Site 291",1,100,7,7542.8737034161522,1960.7253936241273,980,380," ","Daphnia","",2324.837284676019,"Micropterus","",2987.6319235481492,"Oncorhynchus","",3312.0824262524493,"Ceriodaphnia","",7770.4797554555653,null,"Salmo","",434.41001855057362,"Salvelinus","",638.17632596029205,"Daphnia","",985.25892001760678,"Lampsilis","",1026.1097707747783]
[null,"Site 292",1,100,7,7542.8737034161522,1960.7253936241273,980,380," ","Daphnia","",2324.837284676019,"Micropterus","",2987.6319235481492,"Oncorhynchus","",3312.0824262524493,"Ceriodaphnia","",7770.4797554555653,null,"Salmo","",434.41001855057362,"Salvelinus","",638.17632596029205,"Daphnia","",985.25892001760678,"Lampsilis","",1026.1097707747783]
[null,"Site 293",1,100,7,7542.8737034161522,1960.7253936241273,980,380," ","Daphnia","",2324.837284676019,"Micropterus","",2987.6319235481492,"Oncorhynchus","",3312.0824262524493,"Ceriodaphnia","",7770.4797554555653,null,"Salmo","",434.41001855057362,"Salvelinus","",638.17632596029205,"Daphnia","",985.25892001760678,"Lampsilis","",1026.1097707747783]
[null,"Site 294",1,100,7,7542.8737034161522,1960.7253936241273,980,380," ","Daphnia","",2324.837284676019,"Micropterus","",2987.6319235481492,"Oncorhynchus","",3312.0824262524493,"Ceriodaphnia","",7770.4797554555653,null,"Salmo","",434.41001855057362,"Salvelinus","",638.17632596029205,"Daphnia","",985.25892001760678,"Lampsilis","",1026.1097707747783]
[null,"Site 295",1,100,7,7542.8737034161522,1960.7253936241273,980,380," ","Daphnia","",2324.837284676019,"Micropterus","",2987.6319235481492,"Oncorhynchus","",3312.0824262524493,"Ceriodaphnia","",7770.4797554555653,null,"Salmo","",434.41001855057362,"Salvelinus","",638.17632596029205,"Daphnia","",985.25892001760678,"Lampsilis","",1026.1097707747783]
[null,"Site 296",1,100,7,7542.8737034161522,1960.7253936241273,980,380," ","Daphnia","",2324.837284676019,"Micropterus","",2987.6319235481492,"Oncorhynchus","",3312.0824262524493,"Ceriodaphnia","",7770.4797554555653,null,"Salmo","",434.41001855057362,"Salvelinus","",638.17632596029205,"Daphnia","",985.25892001760678,"Lampsilis","",1026.1097707747783]
[null,"Site 297",1,100,7,7542.8737034161522,1960.7253936241273,980,380," ","Daphnia","",2324.837284676019,"Micropterus","",2987.6319235481492,"Oncorhynchus","",3312.0824262524493,"Ceriodaphnia","",7770.4797554555653,null,"Salmo","",434.41001855057362,"Salvelinus","",638.17632596029205,"Daphnia","",985.25892001760678,"Lampsilis","",1026.1097707747783]
[null,"Site 298",1,100,7,7542.8737034161522,1960.7253936241273,980,380," ","Daphnia","",2324.837284676019,"Micropterus","",2987.6319235481492,"Oncorhynchus","",3312.0824262524493,"Ceriodaphnia","",7770.4797554555653,null,"Salmo","",434.41001855057362,"Salvelinus","",638.17632596029205,"Daphnia","",985.25892001760678,"Lampsilis","",1026.1097707747783]
[null,"Site 299",1,100,7,7542.8737034161522,1960.7253936241273,980,380," ","Daphnia","",2324.837284676019,"Micropterus","",2987.6319235481492,"Oncorhynchus","",3312.0824262524493,"Ceriodaphnia","",7770.4797554555653,null,"Salmo","",434.41001855057362,"Salvelinus","",638.17632596029205,"Daphnia","",985.25892001760678,"Lampsilis","",1026.1097707747783]
[null,"Site 300",1,100,7,7542.8737034161522,1960.7253936241273,980,380," ","Daphnia","",2324.837284676019,"Micropterus","",2987.6319235481492,"Oncorhynchus","",3312.0824262524493,"Ceriodaphnia","",7770.4797554555653,null,"Salmo","",434.41001855057362,"Salvelinus","",638.17632596029205,"Daphnia","",985.25892001760678,"Lampsilis","",1026.1097707747783]
[null,"Site 301",1,100,7,null,1960.7253936241273,980,380," ","Daphnia","",2324.837284676019,"Micropterus","",2987.6319235481492,"Oncorhynchus","",3312.0824262524493,"Ceriodaphnia","",7770.4797554555653,null,"Salmo","",434.41001855057362,"Salvelinus","",638.17632596029205,"Daphnia","",985.25892001760678,"Lampsilis","",1026.1097707747783]
[null,"Site 302",1,100,7,null,1960.7253936241273,980,380," ","Daphnia","",2324.837284676019,"Micropterus","",2987.6319235481492,"Oncorhynchus","",3312.0824262524493,"Ceriodaphnia","",7770.4797554555653,null,"Salmo","",434.41001855057362,"Salvelinus","",638.17632596029205,"Daphnia","",985.25892001760678,"Lampsilis","",1026.1097707747783]
[null,"Site 303",1,100,7,null,1960.7253936241273,980,380," ","Daphnia","",2324.837284676019,"Micropterus","",2987.6319235481492,"Oncorhynchus","",3312.0824262524493,"Ceriodaphnia","",7770.4797554555653,null,"Salmo","",434.41001855057362,"Salvelinus","",638.17632596029205,"Daphnia","",985.25892001760678,"Lampsilis","",1026.1097707747783]
[null,"Site 304",1,100,7,null,1960.7253936241273,980,380," ","Daphnia","",2324.837284676019,"Micropterus","",2987.6319235481492,"Oncorhynchus","",3312.0824262524493,"Ceriodaphnia","",7770.4797554555653,null,"Salmo","",434.41001855057362,"Salvelinus","",638.17632596029205,"Daphnia","",985.25892001760678,"Lampsilis","",1026.1097707747783]
[null,"Site 305",1,100,7,null,1960.7253936241273,980,380," ","Daphnia","",2324.837284676019,"Micropterus","",2987.6319235481492,"Oncorhynchus","",3312.0824262524493,"Ceriodaphnia","",7770.4797554555653,null,"Salmo","",434.41001855057362,"Salvelinus","",638.17632596029205,"Daphnia","",985.25892001760678,"Lampsilis","",1026.1097707747783]
[null,"Site 306",1,100,7,null,1960.7253936241273,980,380," ","Daphnia","",2324.837284676019,"Micropterus","",2987.6319235481492,"Oncorhynchus","",3312.0824262524493,"Ceriodaphnia","",7770.4797554555653,null,"Salmo","",434.41001855057362,"Salvelinus","",638.17632596029205,"Daphnia","",985.25892001760678,"Lampsilis","",1026.1097707747783]
[null,"Site 307",1,100,7,null,1960.7253936241273,980,380," ","Daphnia","",2324.837284676019,"Micropterus","",2987.6319235481492,"Oncorhynchus","",3312.0824262524493,"Ceriodaphnia","",7770.4797554555653,null,"Salmo","",434.41001855057362,"Salvelinus","",638.17632596029205,"Daphnia","",985.25892001760678,"Lampsilis","",1026.1097707747783]
[null,"Site 308",1,100,7,null,1960.7253936241273,980,380," ","Daphnia","",2324.837284676019,"Micropterus","",2987.6319235481492,"Oncorhynchus","",3312.0824262524493,"Ceriodaphnia","",7770.4797554555653,null,"Salmo","",434.41001855057362,"Salvelinus","",638.17632596029205,"Daphnia","",985.25892001760678,"Lampsilis","",1026.1097707747783]
[null,"Site 309",1,100,7,null,1960.7253936241273,980,380," ","Daphnia","",2324.837284676019,"Micropterus","",2987.6319235481492,"Oncorhynchus","",3312.0824262524493,"Ceriodaphnia","",7770.4797554555653,null,"Salmo","",434.41001855057362,"Salvelinus","",638.17632596029205,"Daphnia","",985.25892001760678,"Lampsilis","",1026.1097707747783]
[null,"Site 310",1,100,7,null,1960.7253936241273,980,380," ","Daphnia","",2324.837284676019,"Micropterus","",2987.6319235481492,"Oncorhynchus","",3312.0824262524493,"Ceriodaphnia","",7770.4797554555653,null,"Salmo","",434.41001855057362,"Salvelinus","",638.17632596029205,"Daphnia","",985.25892001760678,"Lampsilis","",1026.1097707747783]
[null,"Site 311",1,100,7,null,1960.7253936241273,980,380," ","Daphnia","",2324.837284676019,"Micropterus","",2987.6319235481492,"Oncorhynchus","",3312.0824262524493,"Ceriodaphnia","",7770.4797554555653,null,"Salmo","",434.41001855057362,"Salvelinus","",638.17632596029205,"Daphnia","",985.25892001760678,"Lampsilis","",1026.1097707747783]
[null,"Site 312",1,100,7,null,1960.7253936241273,980,380," ","Daphnia","",2324.837284676019,"Micropterus","",2987.6319235481492,"Oncorhynchus","",3312.0824262524493,"Ceriodaphnia","",7770.4797554555653,null,"Salmo","",434.41001855057362,"Salvelinus","",638.17632596029205,"Daphnia","",985.25892001760678,"Lampsilis","",1026.1097707747783]
[null,"Site 313",1,100,7,null,1960.7253936241273,980,380," ","Daphnia","",2324.837284676019,"Micropterus","",2987.6319235481492,"Oncorhynchus","",3312.0824262524493,"Ceriodaphnia","",7770.4797554555653,null,"Salmo","",434.41001855057362,"Salvelinus","",638.17632596029205,"Daphnia","",985.25892001760678,"Lampsilis","",1026.1097707747783]
[null,"Site 314",1,100,7,null,1960.7253936241273,980,380," ","Daphnia","",2324.837284676019,"Micropterus","",2987.6319235481492,"Oncorhynchus","",3312.0824262524493,"Ceriodaphnia","",7770.4797554555653,null,"Salmo","",434.41001855057362,"Salvelinus","",638.17632596029205,"Daphnia","",985.25892001760678,"Lampsilis","",1026.1097707747783]
[null,"Site 315",1,100,7,null,1960.7253936241273,980,380," ","Daphnia","",2324.837284676019,"Micropterus","",2987.6319235481492,"Oncorhynchus","",3312.0824262524493,"Ceriodaphnia","",7770.4797554555653,null,"Salmo","",434.41001855057362,"Salvelinus","",638.17632596029205,"Daphnia","",985.25892001760678,"Lampsilis","",1026.1097707747783]
[null,"Site 316",1,100,7,null,1960.7253936241273,980,380," ","Daphnia","",2324.837284676019,"Micropterus","",2987.6319235481492,"Oncorhynchus","",3312.0824262524493,"Ceriodaphnia","",7770.4797554555653,null,"Salmo","",434.41001855057362,"Salvelinus","",638.17632596029205,"Daphnia","",985.25892001760678,"Lampsilis","",1026.1097707747783]
[null,"Site 317",1,100,7,null,1960.7253936241273,980,380," ","Daphnia","",2324.837284676019,"Micropterus","",2987.6319235481492,"Oncorhynchus","",3312.0824262524493,"Ceriodaphnia","",7770.4797554555653,null,"Salmo","",434.41001855057362,"Salvelinus","",638.17632596029205,"Daphnia","",985.25892001760678,"Lampsilis","",1026.1097707747783]
[null,"Site 318",1,100,7,null,1960.7253936241273,980,380," ","Daphnia","",2324.837284676019,"Micropterus","",2987.6319235481492,"Oncorhynchus","",3312.0824262524493,"Ceriodaphnia","",7770.4797554555653,null,"Salmo","",434.41001855057362,"Salvelinus","",638.17632596029205,"Daphnia","",985.25892001760678,"Lampsilis","",1026.1097707747783]
[null,"Site 319",1,100,7,null,1960.7253936241273,980,380," ","Daphnia","",2324.837284676019,"Micropterus","",2987.6319235481492,"Oncorhynchus","",3312.0824262524493,"Ceriodaphnia","",7770.4797554555653,null,"Salmo","",434.41001855057362,"Salvelinus","",638.17632596029205,"Daphnia","",985.25892001760678,"Lampsilis","",1026.1097707747783]
[null,"Site 320",1,100,7,null,1960.7253936241273,980,380," ","Daphnia","",2324.837284676019,"Micropterus","",2987.6319235481492,"Oncorhynchus","",3312.0824262524493,"Ceriodaphnia","",7770.4797554555653,null,"Salmo","",434.41001855057362,"Salvelinus","",638.17632596029205,"Daphnia","",985.25892001760678,"Lampsilis","",1026.1097707747783]
[null,"Site 321",1,100,7,null,1960.7253936241273,980,380," ","Daphnia","",2324.837284676019,"Micropterus","",2987.6319235481492,"Oncorhynchus","",3312.0824262524493,"Ceriodaphnia","",7770.4797554555653,null,"Salmo","",434.41001855057362,"Salvelinus","",638.17632596029205,"Daphnia","",985.25892001760678,"Lampsilis","",1026.1097707747783]
[null,"Site 322",1,100,7,null,1960.7253936241273,980,380,{"$f":"IF(OR(C331>12,D331>430,E331<6,E331>8.2),\"Outside model inputs\",\" \")","v":" "},"Daphnia","",2324.837284676019,"Micropterus","",2987.6319235481492,"Oncorhynchus","",3312.0824262524493,"Ceriodaphnia","",7770.4797554555653,null,"Salmo","",434.41001855057362,"Salvelinus","",638.17632596029205,"Daphnia","",985.25892001760678,"Lampsilis","",1026.1097707747783]
[null,"Site 323",1,100,7,null,1960.7253936241273,980,380," ","Daphnia","",2324.837284676019,"Micropterus","",2987.6319235481492,"Oncorhynchus","",3312.0824262524493,"Ceriodaphnia","",7770.4797554555653,null,"Salmo","",434.41001855057362,"Salvelinus","",638.17632596029205,"Daphnia","",985.25892001760678,"Lampsilis","",1026.1097707747783]
[null,"Site 324",1,100,7,null,1960.7253936241273,980,380," ","Daphnia","",2324.837284676019,"Micropterus","",2987.6319235481492,"Oncorhynchus","",3312.0824262524493,"Ceriodaphnia","",7770.4797554555653,null,"Salmo","",434.41001855057362,"Salvelinus","",638.17632596029205,"Daphnia","",985.25892001760678,"Lampsilis","",1026.1097707747783]
[null,"Site 325",1,100,7,null,1960.7253936241273,980,380," ","Daphnia","",2324.837284676019,"Micropterus","",2987.6319235481492,"Oncorhynchus","",3312.0824262524493,"Ceriodaphnia","",7770.4797554555653,null,"Salmo","",434.41001855057362,"Salvelinus","",638.17632596029205,"Daphnia","",985.25892001760678,"Lampsilis","",1026.1097707747783]
[null,"Site 326",1,100,7,null,1960.7253936241273,980,380," ","Daphnia","",2324.837284676019,"Micropterus","",2987.6319235481492,"Oncorhynchus","",3312.0824262524493,"Ceriodaphnia","",7770.4797554555653,null,"Salmo","",434.41001855057362,"Salvelinus","",638.17632596029205,"Daphnia","",985.25892001760678,"Lampsilis","",1026.1097707747783]
[null,"Site 327",1,100,7,null,1960.7253936241273,980,380," ","Daphnia","",2324.837284676019,"Micropterus","",2987.6319235481492,"Oncorhynchus","",3312.0824262524493,"Ceriodaphnia","",7770.4797554555653,null,"Salmo","",434.41001855057362,"Salvelinus","",638.17632596029205,"Daphnia","",985.25892001760678,"Lampsilis","",1026.1097707747783]
[null,"Site 328",1,100,7,null,1960.7253936241273,980,380," ","Daphnia","",2324.837284676019,"Micropterus","",2987.6319235481492,"Oncorhynchus","",3312.0824262524493,"Ceriodaphnia","",7770.4797554555653,null,"Salmo","",434.41001855057362,"Salvelinus","",638.17632596029205,"Daphnia","",985.25892001760678,"Lampsilis","",1026.1097707747783]
[null,"Site 329",1,100,7,null,1960.7253936241273,980,380," ","Daphnia","",2324.837284676019,"Micropterus","",2987.6319235481492,"Oncorhynchus","",3312.0824262524493,"Ceriodaphnia","",7770.4797554555653,null,"Salmo","",434.41001855057362,"Salvelinus","",638.17632596029205,"Daphnia","",985.25892001760678,"Lampsilis","",1026.1097707747783]
[null,"Site 330",1,100,7,null,1960.7253936241273,980,380," ","Daphnia","",2324.837284676019,"Micropterus","",2987.6319235481492,"Oncorhynchus","",3312.0824262524493,"Ceriodaphnia","",7770.4797554555653,null,"Salmo","",434.41001855057362,"Salvelinus","",638.17632596029205,"Daphnia","",985.25892001760678,"Lampsilis","",1026.1097707747783]
[null,"Site 331",1,100,7,null,1960.7253936241273,980,380," ","Daphnia","",2324.837284676019,"Micropterus","",2987.6319235481492,"Oncorhynchus","",3312.0824262524493,"Ceriodaphnia","",7770.4797554555653,null,"Salmo","",434.41001855057362,"Salvelinus","",638.17632596029205,"Daphnia","",985.25892001760678,"Lampsilis","",1026.1097707747783]
[null,"Site 332",1,100,7,null,1960.7253936241273,980,380," ","Daphnia","",2324.837284676019,"Micropterus","",2987.6319235481492,"Oncorhynchus","",3312.0824262524493,"Ceriodaphnia","",7770.4797554555653,null,"Salmo","",434.41001855057362,"Salvelinus","",638.17632596029205,"Daphnia","",985.25892001760678,"Lampsilis","",1026.1097707747783]
[null,"Site 333",1,100,7,null,1960.7253936241273,980,380," ","Daphnia","",2324.837284676019,"Micropterus","",2987.6319235481492,"Oncorhynchus","",3312.0824262524493,"Ceriodaphnia","",7770.4797554555653,null,"Salmo","",434.41001855057362,"Salvelinus","",638.17632596029205,"Daphnia","",985.25892001760678,"Lampsilis","",1026.1097707747783]
[null,"Site 334",1,100,7,null,1960.7253936241273,980,380," ","Daphnia","",2324.837284676019,"Micropterus","",2987.6319235481492,"Oncorhynchus","",3312.0824262524493,"Ceriodaphnia","",7770.4797554555653,null,"Salmo","",434.41001855057362,"Salvelinus","",638.17632596029205,"Daphnia","",985.25892001760678,"Lampsilis","",1026.1097707747783]
[null,"Site 335",1,100,7,null,1960.7253936241273,980,380," ","Daphnia","",2324.837284676019,"Micropterus","",2987.6319235481492,"Oncorhynchus","",3312.0824262524493,"Ceriodaphnia","",7770.4797554555653,null,"Salmo","",434.41001855057362,"Salvelinus","",638.17632596029205,"Daphnia","",985.25892001760678,"Lampsilis","",1026.1097707747783]
[null,"Site 336",1,100,7,null,1960.7253936241273,980,380," ","Daphnia","",2324.837284676019,"Micropterus","",2987.6319235481492,"Oncorhynchus","",3312.0824262524493,"Ceriodaphnia","",7770.4797554555653,null,"Salmo","",434.41001855057362,"Salvelinus","",638.17632596029205,"Daphnia","",985.25892001760678,"Lampsilis","",1026.1097707747783]
[null,"Site 337",1,100,7,null,1960.7253936241273,980,380," ","Daphnia","",2324.837284676019,"Micropterus","",2987.6319235481492,"Oncorhynchus","",3312.0824262524493,"Ceriodaphnia","",7770.4797554555653,null,"Salmo","",434.41001855057362,"Salvelinus","",638.17632596029205,"Daphnia","",985.25892001760678,"Lampsilis","",1026.1097707747783]
[null,"Site 338",1,100,7,null,1960.7253936241273,980,380," ","Daphnia","",2324.837284676019,"Micropterus","",2987.6319235481492,"Oncorhynchus","",3312.0824262524493,"Ceriodaphnia","",7770.4797554555653,null,"Salmo","",434.41001855057362,"Salvelinus","",638.17632596029205,"Daphnia","",985.25892001760678,"Lampsilis","",1026.1097707747783]
[null,"Site 339",1,100,7,null,1960.7253936241273,980,380," ","Daphnia","",2324.837284676019,"Micropterus","",2987.6319235481492,"Oncorhynchus","",3312.0824262524493,"Ceriodaphnia","",7770.4797554555653,null,"Salmo","",434.41001855057362,"Salvelinus","",638.17632596029205,"Daphnia","",985.25892001760678,"Lampsilis","",1026.1097707747783]
[null,"Site 340",1,100,7,null,1960.7253936241273,980,380," ","Daphnia","",2324.837284676019,"Micropterus","",2987.6319235481492,"Oncorhynchus","",3312.0824262524493,"Ceriodaphnia","",7770.4797554555653,null,"Salmo","",434.41001855057362,"Salvelinus","",638.17632596029205,"Daphnia","",985.25892001760678,"Lampsilis","",1026.1097707747783]
[null,"Site 341",1,100,7,null,1960.7253936241273,980,380," ","Daphnia","",2324.837284676019,"Micropterus","",2987.6319235481492,"Oncorhynchus","",3312.0824262524493,"Ceriodaphnia","",7770.4797554555653,null,"Salmo","",434.41001855057362,"Salvelinus","",638.17632596029205,"Daphnia","",985.25892001760678,"Lampsilis","",1026.1097707747783]
[null,"Site 342",1,100,7,null,1960.7253936241273,980,380," ","Daphnia","",2324.837284676019,"Micropterus","",2987.6319235481492,"Oncorhynchus","",3312.0824262524493,"Ceriodaphnia","",7770.4797554555653,null,"Salmo","",434.41001855057362,"Salvelinus","",638.17632596029205,"Daphnia","",985.25892001760678,"Lampsilis","",1026.1097707747783]
[null,"Site 343",1,100,7,null,1960.7253936241273,980,380," ","Daphnia","",2324.837284676019,"Micropterus","",2987.6319235481492,"Oncorhynchus","",3312.0824262524493,"Ceriodaphnia","",7770.4797554555653,null,"Salmo","",434.41001855057362,"Salvelinus","",638.17632596029205,"Daphnia","",985.25892001760678,"Lampsilis","",1026.1097707747783]
[null,"Site 344",1,100,7,null,1960.7253936241273,980,380," ","Daphnia","",2324.837284676019,"Micropterus","",2987.6319235481492,"Oncorhynchus","",3312.0824262524493,"Ceriodaphnia","",7770.4797554555653,null,"Salmo","",434.41001855057362,"Salvelinus","",638.17632596029205,"Daphnia","",985.25892001760678,"Lampsilis","",1026.1097707747783]
[null,"Site 345",1,100,7,null,1960.7253936241273,980,380," ","Daphnia","",2324.837284676019,"Micropterus","",2987.6319235481492,"Oncorhynchus","",3312.0824262524493,"Ceriodaphnia","",7770.4797554555653,null,"Salmo","",434.41001855057362,"Salvelinus","",638.17632596029205,"Daphnia","",985.25892001760678,"Lampsilis","",1026.1097707747783]
[null,"Site 346",1,100,7,null,1960.7253936241273,980,380," ","Daphnia","",2324.837284676019,"Micropterus","",2987.6319235481492,"Oncorhynchus","",3312.0824262524493,"Ceriodaphnia","",7770.4797554555653,null,"Salmo","",434.41001855057362,"Salvelinus","",638.17632596029205,"Daphnia","",985.25892001760678,"Lampsilis","",1026.1097707747783]
[null,"Site 347",1,100,7,null,1960.7253936241273,980,380," ","Daphnia","",2324.837284676019,"Micropterus","",2987.6319235481492,"Oncorhynchus","",3312.0824262524493,"Ceriodaphnia","",7770.4797554555653,null,"Salmo","",434.41001855057362,"Salvelinus","",638.17632596029205,"Daphnia","",985.25892001760678,"Lampsilis","",1026.1097707747783]
[null,"Site 348",1,100,7,null,1960.7253936241273,980,380," ","Daphnia","",2324.837284676019,"Micropterus","",2987.6319235481492,"Oncorhynchus","",3312.0824262524493,"Ceriodaphnia","",7770.4797554555653,null,"Salmo","",434.41001855057362,"Salvelinus","",638.17632596029205,"Daphnia","",985.25892001760678,"Lampsilis","",1026.1097707747783]
[null,"Site 349",1,100,7,null,1960.7253936241273,980,380," ","Daphnia","",2324.837284676019,"Micropterus","",2987.6319235481492,"Oncorhynchus","",3312.0824262524493,"Ceriodaphnia","",7770.4797554555653,null,"Salmo","",434.41001855057362,"Salvelinus","",638.17632596029205,"Daphnia","",985.25892001760678,"Lampsilis","",1026.1097707747783]
[null,"Site 350",1,100,7,null,1960.7253936241273,980,380," ","Daphnia","",2324.837284676019,"Micropterus","",2987.6319235481492,"Oncorhynchus","",3312.0824262524493,"Ceriodaphnia","",7770.4797554555653,null,"Salmo","",434.41001855057362,"Salvelinus","",638.17632596029205,"Daphnia","",985.25892001760678,"Lampsilis","",1026.1097707747783]
[null,"Site 351",1,100,7,null,1960.7253936241273,980,380," ","Daphnia","",2324.837284676019,"Micropterus","",2987.6319235481492,"Oncorhynchus","",3312.0824262524493,"Ceriodaphnia","",7770.4797554555653,null,"Salmo","",434.41001855057362,"Salvelinus","",638.17632596029205,"Daphnia","",985.25892001760678,"Lampsilis","",1026.1097707747783]
[null,"Site 352",1,100,7,null,1960.7253936241273,980,380," ","Daphnia","",2324.837284676019,"Micropterus","",2987.6319235481492,"Oncorhynchus","",3312.0824262524493,"Ceriodaphnia","",7770.4797554555653,null,"Salmo","",434.41001855057362,"Salvelinus","",638.17632596029205,"Daphnia","",985.25892001760678,"Lampsilis","",1026.1097707747783]
[null,"Site 353",1,100,7,null,1960.7253936241273,980,380," ","Daphnia","",2324.837284676019,"Micropterus","",2987.6319235481492,"Oncorhynchus","",3312.0824262524493,"Ceriodaphnia","",7770.4797554555653,null,"Salmo","",434.41001855057362,"Salvelinus","",638.17632596029205,"Daphnia","",985.25892001760678,"Lampsilis","",1026.1097707747783]
[null,"Site 354",1,100,7,null,1960.7253936241273,980,380," ","Daphnia","",2324.837284676019,"Micropterus","",2987.6319235481492,"Oncorhynchus","",3312.0824262524493,"Ceriodaphnia","",7770.4797554555653,null,"Salmo","",434.41001855057362,"Salvelinus","",638.17632596029205,"Daphnia","",985.25892001760678,"Lampsilis","",1026.1097707747783]
[null,"Site 355",1,100,7,null,1960.7253936241273,980,380," ","Daphnia","",2324.837284676019,"Micropterus","",2987.6319235481492,"Oncorhynchus","",3312.0824262524493,"Ceriodaphnia","",7770.4797554555653,null,"Salmo","",434.41001855057362,"Salvelinus","",638.17632596029205,"Daphnia","",985.25892001760678,"Lampsilis","",1026.1097707747783]
[null,"Site 356",1,100,7,null,1960.7253936241273,980,380," ","Daphnia","",2324.837284676019,"Micropterus","",2987.6319235481492,"Oncorhynchus","",3312.0824262524493,"Ceriodaphnia","",7770.4797554555653,null,"Salmo","",434.41001855057362,"Salvelinus","",638.17632596029205,"Daphnia","",985.25892001760678,"Lampsilis","",1026.1097707747783]
[null,"Site 357",1,100,7,null,1960.7253936241273,980,380," ","Daphnia","",2324.837284676019,"Micropterus","",2987.6319235481492,"Oncorhynchus","",3312.0824262524493,"Ceriodaphnia","",7770.4797554555653,null,"Salmo","",434.41001855057362,"Salvelinus","",638.17632596029205,"Daphnia","",985.25892001760678,"Lampsilis","",1026.1097707747783]
[null,"Site 358",1,100,7,null,1960.7253936241273,980,380," ","Daphnia","",2324.837284676019,"Micropterus","",2987.6319235481492,"Oncorhynchus","",3312.0824262524493,"Ceriodaphnia","",7770.4797554555653,null,"Salmo","",434.41001855057362,"Salvelinus","",638.17632596029205,"Daphnia","",985.25892001760678,"Lampsilis","",1026.1097707747783]
[null,"Site 359",1,100,7,null,1960.7253936241273,980,380," ","Daphnia","",2324.837284676019,"Micropterus","",2987.6319235481492,"Oncorhynchus","",3312.0824262524493,"Ceriodaphnia","",7770.4797554555653,null,"Salmo","",434.41001855057362,"Salvelinus","",638.17632596029205,"Daphnia","",985.25892001760678,"Lampsilis","",1026.1097707747783]
[null,"Site 360",1,100,7,null,1960.7253936241273,980,380," ","Daphnia","",2324.837284676019,"Micropterus","",2987.6319235481492,"Oncorhynchus","",3312.0824262524493,"Ceriodaphnia","",7770.4797554555653,null,"Salmo","",434.41001855057362,"Salvelinus","",638.17632596029205,"Daphnia","",985.25892001760678,"Lampsilis","",1026.1097707747783]
[null,"Site 361",1,100,7,null,1960.7253936241273,980,380," ","Daphnia","",2324.837284676019,"Micropterus","",2987.6319235481492,"Oncorhynchus","",3312.0824262524493,"Ceriodaphnia","",7770.4797554555653,null,"Salmo","",434.41001855057362,"Salvelinus","",638.17632596029205,"Daphnia","",985.25892001760678,"Lampsilis","",1026.1097707747783]
[null,"Site 362",1,100,7,null,1960.7253936241273,980,380," ","Daphnia","",2324.837284676019,"Micropterus","",2987.6319235481492,"Oncorhynchus","",3312.0824262524493,"Ceriodaphnia","",7770.4797554555653,null,"Salmo","",434.41001855057362,"Salvelinus","",638.17632596029205,"Daphnia","",985.25892001760678,"Lampsilis","",1026.1097707747783]
[null,"Site 363",1,100,7,null,1960.7253936241273,980,380," ","Daphnia","",2324.837284676019,"Micropterus","",2987.6319235481492,"Oncorhynchus","",3312.0824262524493,"Ceriodaphnia","",7770.4797554555653,null,"Salmo","",434.41001855057362,"Salvelinus","",638.17632596029205,"Daphnia","",985.25892001760678,"Lampsilis","",1026.1097707747783]
[null,"Site 364",1,100,7,null,1960.7253936241273,980,380," ","Daphnia","",2324.837284676019,"Micropterus","",2987.6319235481492,"Oncorhynchus","",3312.0824262524493,"Ceriodaphnia","",7770.4797554555653,null,"Salmo","",434.41001855057362,"Salvelinus","",638.17632596029205,"Daphnia","",985.25892001760678,"Lampsilis","",1026.1097707747783]
[null,"Site 365",1,100,7,null,1960.7253936241273,980,380," ","Daphnia","",2324.837284676019,"Micropterus","",2987.6319235481492,"Oncorhynchus","",3312.0824262524493,"Ceriodaphnia","",7770.4797554555653,null,"Salmo","",434.41001855057362,"Salvelinus","",638.17632596029205,"Daphnia","",985.25892001760678,"Lampsilis","",1026.1097707747783]
[null,"Site 366",1,100,7,null,1960.7253936241273,980,380," ","Daphnia","",2324.837284676019,"Micropterus","",2987.6319235481492,"Oncorhynchus","",3312.0824262524493,"Ceriodaphnia","",7770.4797554555653,null,"Salmo","",434.41001855057362,"Salvelinus","",638.17632596029205,"Daphnia","",985.25892001760678,"Lampsilis","",1026.1097707747783]
[null,"Site 367",1,100,7,null,1960.7253936241273,980,380," ","Daphnia","",2324.837284676019,"Micropterus","",2987.6319235481492,"Oncorhynchus","",3312.0824262524493,"Ceriodaphnia","",7770.4797554555653,null,"Salmo","",434.41001855057362,"Salvelinus","",638.17632596029205,"Daphnia","",985.25892001760678,"Lampsilis","",1026.1097707747783]
[null,"Site 368",1,100,7,null,1960.7253936241273,980,380," ","Daphnia","",2324.837284676019,"Micropterus","",2987.6319235481492,"Oncorhynchus","",3312.0824262524493,"Ceriodaphnia","",7770.4797554555653,null,"Salmo","",434.41001855057362,"Salvelinus","",638.17632596029205,"Daphnia","",985.25892001760678,"Lampsilis","",1026.1097707747783]
[null,"Site 369",1,100,7,null,1960.7253936241273,980,380," ","Daphnia","",2324.837284676019,"Micropterus","",2987.6319235481492,"Oncorhynchus","",3312.0824262524493,"Ceriodaphnia","",7770.4797554555653,null,"Salmo","",434.41001855057362,"Salvelinus","",638.17632596029205,"Daphnia","",985.25892001760678,"Lampsilis","",1026.1097707747783]
[null,"Site 370",1,100,7,null,1960.7253936241273,980,380," ","Daphnia","",2324.837284676019,"Micropterus","",2987.6319235481492,"Oncorhynchus","",3312.0824262524493,"Ceriodaphnia","",7770.4797554555653,null,"Salmo","",434.41001855057362,"Salvelinus","",638.17632596029205,"Daphnia","",985.25892001760678,"Lampsilis","",1026.1097707747783]
[null,"Site 371",1,100,7,null,1960.7253936241273,980,380," ","Daphnia","",2324.837284676019,"Micropterus","",2987.6319235481492,"Oncorhynchus","",3312.0824262524493,"Ceriodaphnia","",7770.4797554555653,null,"Salmo","",434.41001855057362,"Salvelinus","",638.17632596029205,"Daphnia","",985.25892001760678,"Lampsilis","",1026.1097707747783]
[null,"Site 372",1,100,7,null,1960.7253936241273,980,380," ","Daphnia","",2324.837284676019,"Micropterus","",2987.6319235481492,"Oncorhynchus","",3312.0824262524493,"Ceriodaphnia","",7770.4797554555653,null,"Salmo","",434.41001855057362,"Salvelinus","",638.17632596029205,"Daphnia","",985.25892001760678,"Lampsilis","",1026.1097707747783]
[null,"Site 373",1,100,7,null,1960.7253936241273,980,380," ","Daphnia","",2324.837284676019,"Micropterus","",2987.6319235481492,"Oncorhynchus","",3312.0824262524493,"Ceriodaphnia","",7770.4797554555653,null,"Salmo","",434.41001855057362,"Salvelinus","",638.17632596029205,"Daphnia","",985.25892001760678,"Lampsilis","",1026.1097707747783]
[null,"Site 374",1,100,7,null,1960.7253936241273,980,380," ","Daphnia","",2324.837284676019,"Micropterus","",2987.6319235481492,"Oncorhynchus","",3312.0824262524493,"Ceriodaphnia","",7770.4797554555653,null,"Salmo","",434.41001855057362,"Salvelinus","",638.17632596029205,"Daphnia","",985.25892001760678,"Lampsilis","",1026.1097707747783]
[null,"Site 375",1,100,7,null,1960.7253936241273,980,380," ","Daphnia","",2324.837284676019,"Micropterus","",2987.6319235481492,"Oncorhynchus","",3312.0824262524493,"Ceriodaphnia","",7770.4797554555653,null,"Salmo","",434.41001855057362,"Salvelinus","",638.17632596029205,"Daphnia","",985.25892001760678,"Lampsilis","",1026.1097707747783]
[null,"Site 376",1,100,7,null,1960.7253936241273,980,380," ","Daphnia","",2324.837284676019,"Micropterus","",2987.6319235481492,"Oncorhynchus","",3312.0824262524493,"Ceriodaphnia","",7770.4797554555653,null,"Salmo","",434.41001855057362,"Salvelinus","",638.17632596029205,"Daphnia","",985.25892001760678,"Lampsilis","",1026.1097707747783]
[null,"Site 377",1,100,7,null,1960.7253936241273,980,380," ","Daphnia","",2324.837284676019,"Micropterus","",2987.6319235481492,"Oncorhynchus","",3312.0824262524493,"Ceriodaphnia","",7770.4797554555653,null,"Salmo","",434.41001855057362,"Salvelinus","",638.17632596029205,"Daphnia","",985.25892001760678,"Lampsilis","",1026.1097707747783]
[null,"Site 378",1,100,7,null,1960.7253936241273,980,380," ","Daphnia","",2324.837284676019,"Micropterus","",2987.6319235481492,"Oncorhynchus","",3312.0824262524493,"Ceriodaphnia","",7770.4797554555653,null,"Salmo","",434.41001855057362,"Salvelinus","",638.17632596029205,"Daphnia","",985.25892001760678,"Lampsilis","",1026.1097707747783]
[null,"Site 379",1,100,7,null,1960.7253936241273,980,380," ","Daphnia","",2324.837284676019,"Micropterus","",2987.6319235481492,"Oncorhynchus","",3312.0824262524493,"Ceriodaphnia","",7770.4797554555653,null,"Salmo","",434.41001855057362,"Salvelinus","",638.17632596029205,"Daphnia","",985.25892001760678,"Lampsilis","",1026.1097707747783]
[null,"Site 380",1,100,7,null,1960.7253936241273,980,380," ","Daphnia","",2324.837284676019,"Micropterus","",2987.6319235481492,"Oncorhynchus","",3312.0824262524493,"Ceriodaphnia","",7770.4797554555653,null,"Salmo","",434.41001855057362,"Salvelinus","",638.17632596029205,"Daphnia","",985.25892001760678,"Lampsilis","",1026.1097707747783]
[null,"Site 381",1,100,7,null,1960.7253936241273,980,380," ","Daphnia","",2324.837284676019,"Micropterus","",2987.6319235481492,"Oncorhynchus","",3312.0824262524493,"Ceriodaphnia","",7770.4797554555653,null,"Salmo","",434.41001855057362,"Salvelinus","",638.17632596029205,"Daphnia","",985.25892001760678,"Lampsilis","",1026.1097707747783]
[null,"Site 382",1,100,7,null,1960.7253936241273,980,380," ","Daphnia","",2324.837284676019,"Micropterus","",2987.6319235481492,"Oncorhynchus","",3312.0824262524493,"Ceriodaphnia","",7770.4797554555653,null,"Salmo","",434.41001855057362,"Salvelinus","",638.17632596029205,"Daphnia","",985.25892001760678,"Lampsilis","",1026.1097707747783]
[null,"Site 383",1,100,7,null,1960.7253936241273,980,380," ","Daphnia","",2324.837284676019,"Micropterus","",2987.6319235481492,"Oncorhynchus","",3312.0824262524493,"Ceriodaphnia","",7770.4797554555653,null,"Salmo","",434.41001855057362,"Salvelinus","",638.17632596029205,"Daphnia","",985.25892001760678,"Lampsilis","",1026.1097707747783]
[null,"Site 384",1,100,7,null,1960.7253936241273,980,380," ","Daphnia","",2324.837284676019,"Micropterus","",2987.6319235481492,"Oncorhynchus","",3312.0824262524493,"Ceriodaphnia","",7770.4797554555653,null,"Salmo","",434.41001855057362,"Salvelinus","",638.17632596029205,"Daphnia","",985.25892001760678,"Lampsilis","",1026.1097707747783]
[null,"Site 385",1,100,7,null,1960.7253936241273,980,380," ","Daphnia","",2324.837284676019,"Micropterus","",2987.6319235481492,"Oncorhynchus","",3312.0824262524493,"Ceriodaphnia","",7770.4797554555653,null,"Salmo","",434.41001855057362,"Salvelinus","",638.17632596029205,"Daphnia","",985.25892001760678,"Lampsilis","",1026.1097707747783]
[null,"Site 386",1,100,7,null,1960.7253936241273,980,380,{"$f":"IF(OR(C395>12,D395>430,E395<6,E395>8.2),\"Outside model inputs\",\" \")","v":" "},"Daphnia","",2324.837284676019,"Micropterus","",2987.6319235481492,"Oncorhynchus","",3312.0824262524493,"Ceriodaphnia","",7770.4797554555653,null,"Salmo","",434.41001855057362,"Salvelinus","",638.17632596029205,"Daphnia","",985.25892001760678,"Lampsilis","",1026.1097707747783]
[null,"Site 387",1,100,7,null,1960.7253936241273,980,380," ","Daphnia","",2324.837284676019,"Micropterus","",2987.6319235481492,"Oncorhynchus","",3312.0824262524493,"Ceriodaphnia","",7770.4797554555653,null,"Salmo","",434.41001855057362,"Salvelinus","",638.17632596029205,"Daphnia","",985.25892001760678,"Lampsilis","",1026.1097707747783]
[null,"Site 388",1,100,7,null,1960.7253936241273,980,380," ","Daphnia","",2324.837284676019,"Micropterus","",2987.6319235481492,"Oncorhynchus","",3312.0824262524493,"Ceriodaphnia","",7770.4797554555653,null,"Salmo","",434.41001855057362,"Salvelinus","",638.17632596029205,"Daphnia","",985.25892001760678,"Lampsilis","",1026.1097707747783]
[null,"Site 389",1,100,7,null,1960.7253936241273,980,380," ","Daphnia","",2324.837284676019,"Micropterus","",2987.6319235481492,"Oncorhynchus","",3312.0824262524493,"Ceriodaphnia","",7770.4797554555653,null,"Salmo","",434.41001855057362,"Salvelinus","",638.17632596029205,"Daphnia","",985.25892001760678,"Lampsilis","",1026.1097707747783]
[null,"Site 390",1,100,7,null,1960.7253936241273,980,380," ","Daphnia","",2324.837284676019,"Micropterus","",2987.6319235481492,"Oncorhynchus","",3312.0824262524493,"Ceriodaphnia","",7770.4797554555653,null,"Salmo","",434.41001855057362,"Salvelinus","",638.17632596029205,"Daphnia","",985.25892001760678,"Lampsilis","",1026.1097707747783]
[null,"Site 391",1,100,7,null,1960.7253936241273,980,380," ","Daphnia","",2324.837284676019,"Micropterus","",2987.6319235481492,"Oncorhynchus","",3312.0824262524493,"Ceriodaphnia","",7770.4797554555653,null,"Salmo","",434.41001855057362,"Salvelinus","",638.17632596029205,"Daphnia","",985.25892001760678,"Lampsilis","",1026.1097707747783]
[null,"Site 392",1,100,7,null,1960.7253936241273,980,380," ","Daphnia","",2324.837284676019,"Micropterus","",2987.6319235481492,"Oncorhynchus","",3312.0824262524493,"Ceriodaphnia","",7770.4797554555653,null,"Salmo","",434.41001855057362,"Salvelinus","",638.17632596029205,"Daphnia","",985.25892001760678,"Lampsilis","",1026.1097707747783]
[null,"Site 393",1,100,7,null,1960.7253936241273,980,380," ","Daphnia","",2324.837284676019,"Micropterus","",2987.6319235481492,"Oncorhynchus","",3312.0824262524493,"Ceriodaphnia","",7770.4797554555653,null,"Salmo","",434.41001855057362,"Salvelinus","",638.17632596029205,"Daphnia","",985.25892001760678,"Lampsilis","",1026.1097707747783]
[null,"Site 394",1,100,7,null,1960.7253936241273,980,380," ","Daphnia","",2324.837284676019,"Micropterus","",2987.6319235481492,"Oncorhynchus","",3312.0824262524493,"Ceriodaphnia","",7770.4797554555653,null,"Salmo","",434.41001855057362,"Salvelinus","",638.17632596029205,"Daphnia","",985.25892001760678,"Lampsilis","",1026.1097707747783]
[null,"Site 395",1,100,7,null,1960.7253936241273,980,380," ","Daphnia","",2324.837284676019,"Micropterus","",2987.6319235481492,"Oncorhynchus","",3312.0824262524493,"Ceriodaphnia","",7770.4797554555653,null,"Salmo","",434.41001855057362,"Salvelinus","",638.17632596029205,"Daphnia","",985.25892001760678,"Lampsilis","",1026.1097707747783]
[null,"Site 396",1,100,7,null,1960.7253936241273,980,380," ","Daphnia","",2324.837284676019,"Micropterus","",2987.6319235481492,"Oncorhynchus","",3312.0824262524493,"Ceriodaphnia","",7770.4797554555653,null,"Salmo","",434.41001855057362,"Salvelinus","",638.17632596029205,"Daphnia","",985.25892001760678,"Lampsilis","",1026.1097707747783]
[null,"Site 397",1,100,7,null,1960.7253936241273,980,380," ","Daphnia","",2324.837284676019,"Micropterus","",2987.6319235481492,"Oncorhynchus","",3312.0824262524493,"Ceriodaphnia","",7770.4797554555653,null,"Salmo","",434.41001855057362,"Salvelinus","",638.17632596029205,"Daphnia","",985.25892001760678,"Lampsilis","",1026.1097707747783]
[null,"Site 398",1,100,7,null,1960.7253936241273,980,380," ","Daphnia","",2324.837284676019,"Micropterus","",2987.6319235481492,"Oncorhynchus","",3312.0824262524493,"Ceriodaphnia","",7770.4797554555653,null,"Salmo","",434.41001855057362,"Salvelinus","",638.17632596029205,"Daphnia","",985.25892001760678,"Lampsilis","",1026.1097707747783]
[null,"Site 399",1,100,7,null,1960.7253936241273,980,380," ","Daphnia","",2324.837284676019,"Micropterus","",2987.6319235481492,"Oncorhynchus","",3312.0824262524493,"Ceriodaphnia","",7770.4797554555653,null,"Salmo","",434.41001855057362,"Salvelinus","",638.17632596029205,"Daphnia","",985.25892001760678,"Lampsilis","",1026.1097707747783]
[null,"Site 400",1,100,7,null,1960.7253936241273,980,380," ","Daphnia","",2324.837284676019,"Micropterus","",2987.6319235481492,"Oncorhynchus","",3312.0824262524493,"Ceriodaphnia","",7770.4797554555653,null,"Salmo","",434.41001855057362,"Salvelinus","",638.17632596029205,"Daphnia","",985.25892001760678,"Lampsilis","",1026.1097707747783]
[null,"Site 401",1,100,7,null,1960.7253936241273,980,380," ","Daphnia","",2324.837284676019,"Micropterus","",2987.6319235481492,"Oncorhynchus","",3312.0824262524493,"Ceriodaphnia","",7770.4797554555653,null,"Salmo","",434.41001855057362,"Salvelinus","",638.17632596029205,"Daphnia","",985.25892001760678,"Lampsilis","",1026.1097707747783]
[null,"Site 402",1,100,7,null,1960.7253936241273,980,380," ","Daphnia","",2324.837284676019,"Micropterus","",2987.6319235481492,"Oncorhynchus","",3312.0824262524493,"Ceriodaphnia","",7770.4797554555653,null,"Salmo","",434.41001855057362,"Salvelinus","",638.17632596029205,"Daphnia","",985.25892001760678,"Lampsilis","",1026.1097707747783]
[null,"Site 403",1,100,7,null,1960.7253936241273,980,380," ","Daphnia","",2324.837284676019,"Micropterus","",2987.6319235481492,"Oncorhynchus","",3312.0824262524493,"Ceriodaphnia","",7770.4797554555653,null,"Salmo","",434.41001855057362,"Salvelinus","",638.17632596029205,"Daphnia","",985.25892001760678,"Lampsilis","",1026.1097707747783]
[null,"Site 404",1,100,7,null,1960.7253936241273,980,380," ","Daphnia","",2324.837284676019,"Micropterus","",2987.6319235481492,"Oncorhynchus","",3312.0824262524493,"Ceriodaphnia","",7770.4797554555653,null,"Salmo","",434.41001855057362,"Salvelinus","",638.17632596029205,"Daphnia","",985.25892001760678,"Lampsilis","",1026.1097707747783]
[null,"Site 405",1,100,7,null,1960.7253936241273,980,380," ","Daphnia","",2324.837284676019,"Micropterus","",2987.6319235481492,"Oncorhynchus","",3312.0824262524493,"Ceriodaphnia","",7770.4797554555653,null,"Salmo","",434.41001855057362,"Salvelinus","",638.17632596029205,"Daphnia","",985.25892001760678,"Lampsilis","",1026.1097707747783]
[null,"Site 406",1,100,7,null,1960.7253936241273,980,380," ","Daphnia","",2324.837284676019,"Micropterus","",2987.6319235481492,"Oncorhynchus","",3312.0824262524493,"Ceriodaphnia","",7770.4797554555653,null,"Salmo","",434.41001855057362,"Salvelinus","",638.17632596029205,"Daphnia","",985.25892001760678,"Lampsilis","",1026.1097707747783]
[null,"Site 407",1,100,7,null,1960.7253936241273,980,380," ","Daphnia","",2324.837284676019,"Micropterus","",2987.6319235481492,"Oncorhynchus","",3312.0824262524493,"Ceriodaphnia","",7770.4797554555653,null,"Salmo","",434.41001855057362,"Salvelinus","",638.17632596029205,"Daphnia","",985.25892001760678,"Lampsilis","",1026.1097707747783]
[null,"Site 408",1,100,7,null,1960.7253936241273,980,380," ","Daphnia","",2324.837284676019,"Micropterus","",2987.6319235481492,"Oncorhynchus","",3312.0824262524493,"Ceriodaphnia","",7770.4797554555653,null,"Salmo","",434.41001855057362,"Salvelinus","",638.17632596029205,"Daphnia","",985.25892001760678,"Lampsilis","",1026.1097707747783]
[null,"Site 409",1,100,7,null,1960.7253936241273,980,380," ","Daphnia","",2324.837284676019,"Micropterus","",2987.6319235481492,"Oncorhynchus","",3312.0824262524493,"Ceriodaphnia","",7770.4797554555653,null,"Salmo","",434.41001855057362,"Salvelinus","",638.17632596029205,"Daphnia","",985.25892001760678,"Lampsilis","",1026.1097707747783]
[null,"Site 410",1,100,7,null,1960.7253936241273,980,380," ","Daphnia","",2324.837284676019,"Micropterus","",2987.6319235481492,"Oncorhynchus","",3312.0824262524493,"Ceriodaphnia","",7770.4797554555653,null,"Salmo","",434.41001855057362,"Salvelinus","",638.17632596029205,"Daphnia","",985.25892001760678,"Lampsilis","",1026.1097707747783]
[null,"Site 411",1,100,7,null,1960.7253936241273,980,380," ","Daphnia","",2324.837284676019,"Micropterus","",2987.6319235481492,"Oncorhynchus","",3312.0824262524493,"Ceriodaphnia","",7770.4797554555653,null,"Salmo","",434.41001855057362,"Salvelinus","",638.17632596029205,"Daphnia","",985.25892001760678,"Lampsilis","",1026.1097707747783]
[null,"Site 412",1,100,7,null,1960.7253936241273,980,380," ","Daphnia","",2324.837284676019,"Micropterus","",2987.6319235481492,"Oncorhynchus","",3312.0824262524493,"Ceriodaphnia","",7770.4797554555653,null,"Salmo","",434.41001855057362,"Salvelinus","",638.17632596029205,"Daphnia","",985.25892001760678,"Lampsilis","",1026.1097707747783]
[null,"Site 413",1,100,7,null,1960.7253936241273,980,380," ","Daphnia","",2324.837284676019,"Micropterus","",2987.6319235481492,"Oncorhynchus","",3312.0824262524493,"Ceriodaphnia","",7770.4797554555653,null,"Salmo","",434.41001855057362,"Salvelinus","",638.17632596029205,"Daphnia","",985.25892001760678,"Lampsilis","",1026.1097707747783]
[null,"Site 414",1,100,7,null,1960.7253936241273,980,380," ","Daphnia","",2324.837284676019,"Micropterus","",2987.6319235481492,"Oncorhynchus","",3312.0824262524493,"Ceriodaphnia","",7770.4797554555653,null,"Salmo","",434.41001855057362,"Salvelinus","",638.17632596029205,"Daphnia","",985.25892001760678,"Lampsilis","",1026.1097707747783]
[null,"Site 415",1,100,7,null,1960.7253936241273,980,380," ","Daphnia","",2324.837284676019,"Micropterus","",2987.6319235481492,"Oncorhynchus","",3312.0824262524493,"Ceriodaphnia","",7770.4797554555653,null,"Salmo","",434.41001855057362,"Salvelinus","",638.17632596029205,"Daphnia","",985.25892001760678,"Lampsilis","",1026.1097707747783]
[null,"Site 416",1,100,7,null,1960.7253936241273,980,380," ","Daphnia","",2324.837284676019,"Micropterus","",2987.6319235481492,"Oncorhynchus","",3312.0824262524493,"Ceriodaphnia","",7770.4797554555653,null,"Salmo","",434.41001855057362,"Salvelinus","",638.17632596029205,"Daphnia","",985.25892001760678,"Lampsilis","",1026.1097707747783]
[null,"Site 417",1,100,7,null,1960.7253936241273,980,380," ","Daphnia","",2324.837284676019,"Micropterus","",2987.6319235481492,"Oncorhynchus","",3312.0824262524493,"Ceriodaphnia","",7770.4797554555653,null,"Salmo","",434.41001855057362,"Salvelinus","",638.17632596029205,"Daphnia","",985.25892001760678,"Lampsilis","",1026.1097707747783]
[null,"Site 418",1,100,7,null,1960.7253936241273,980,380," ","Daphnia","",2324.837284676019,"Micropterus","",2987.6319235481492,"Oncorhynchus","",3312.0824262524493,"Ceriodaphnia","",7770.4797554555653,null,"Salmo","",434.41001855057362,"Salvelinus","",638.17632596029205,"Daphnia","",985.25892001760678,"Lampsilis","",1026.1097707747783]
[null,"Site 419",1,100,7,null,1960.7253936241273,980,380," ","Daphnia","",2324.837284676019,"Micropterus","",2987.6319235481492,"Oncorhynchus","",3312.0824262524493,"Ceriodaphnia","",7770.4797554555653,null,"Salmo","",434.41001855057362,"Salvelinus","",638.17632596029205,"Daphnia","",985.25892001760678,"Lampsilis","",1026.1097707747783]
[null,"Site 420",1,100,7,null,1960.7253936241273,980,380," ","Daphnia","",2324.837284676019,"Micropterus","",2987.6319235481492,"Oncorhynchus","",3312.0824262524493,"Ceriodaphnia","",7770.4797554555653,null,"Salmo","",434.41001855057362,"Salvelinus","",638.17632596029205,"Daphnia","",985.25892001760678,"Lampsilis","",1026.1097707747783]
[null,"Site 421",1,100,7,null,1960.7253936241273,980,380," ","Daphnia","",2324.837284676019,"Micropterus","",2987.6319235481492,"Oncorhynchus","",3312.0824262524493,"Ceriodaphnia","",7770.4797554555653,null,"Salmo","",434.41001855057362,"Salvelinus","",638.17632596029205,"Daphnia","",985.25892001760678,"Lampsilis","",1026.1097707747783]
[null,"Site 422",1,100,7,null,1960.7253936241273,980,380," ","Daphnia","",2324.837284676019,"Micropterus","",2987.6319235481492,"Oncorhynchus","",3312.0824262524493,"Ceriodaphnia","",7770.4797554555653,null,"Salmo","",434.41001855057362,"Salvelinus","",638.17632596029205,"Daphnia","",985.25892001760678,"Lampsilis","",1026.1097707747783]
[null,"Site 423",1,100,7,null,1960.7253936241273,980,380," ","Daphnia","",2324.837284676019,"Micropterus","",2987.6319235481492,"Oncorhynchus","",3312.0824262524493,"Ceriodaphnia","",7770.4797554555653,null,"Salmo","",434.41001855057362,"Salvelinus","",638.17632596029205,"Daphnia","",985.25892001760678,"Lampsilis","",1026.1097707747783]
[null,"Site 424",1,100,7,null,1960.7253936241273,980,380," ","Daphnia","",2324.837284676019,"Micropterus","",2987.6319235481492,"Oncorhynchus","",3312.0824262524493,"Ceriodaphnia","",7770.4797554555653,null,"Salmo","",434.41001855057362,"Salvelinus","",638.17632596029205,"Daphnia","",985.25892001760678,"Lampsilis","",1026.1097707747783]
[null,"Site 425",1,100,7,null,1960.7253936241273,980,380," ","Daphnia","",2324.837284676019,"Micropterus","",2987.6319235481492,"Oncorhynchus","",3312.0824262524493,"Ceriodaphnia","",7770.4797554555653,null,"Salmo","",434.41001855057362,"Salvelinus","",638.17632596029205,"Daphnia","",985.25892001760678,"Lampsilis","",1026.1097707747783]
[null,"Site 426",1,100,7,null,1960.7253936241273,980,380," ","Daphnia","",2324.837284676019,"Micropterus","",2987.6319235481492,"Oncorhynchus","",3312.0824262524493,"Ceriodaphnia","",7770.4797554555653,null,"Salmo","",434.41001855057362,"Salvelinus","",638.17632596029205,"Daphnia","",985.25892001760678,"Lampsilis","",1026.1097707747783]
[null,"Site 427",1,100,7,null,1960.7253936241273,980,380," ","Daphnia","",2324.837284676019,"Micropterus","",2987.6319235481492,"Oncorhynchus","",3312.0824262524493,"Ceriodaphnia","",7770.4797554555653,null,"Salmo","",434.41001855057362,"Salvelinus","",638.17632596029205,"Daphnia","",985.25892001760678,"Lampsilis","",1026.1097707747783]
[null,"Site 428",1,100,7,null,1960.7253936241273,980,380," ","Daphnia","",2324.837284676019,"Micropterus","",2987.6319235481492,"Oncorhynchus","",3312.0824262524493,"Ceriodaphnia","",7770.4797554555653,null,"Salmo","",434.41001855057362,"Salvelinus","",638.17632596029205,"Daphnia","",985.25892001760678,"Lampsilis","",1026.1097707747783]
[null,"Site 429",1,100,7,null,1960.7253936241273,980,380," ","Daphnia","",2324.837284676019,"Micropterus","",2987.6319235481492,"Oncorhynchus","",3312.0824262524493,"Ceriodaphnia","",7770.4797554555653,null,"Salmo","",434.41001855057362,"Salvelinus","",638.17632596029205,"Daphnia","",985.25892001760678,"Lampsilis","",1026.1097707747783]
[null,"Site 430",1,100,7,null,1960.7253936241273,980,380," ","Daphnia","",2324.837284676019,"Micropterus","",2987.6319235481492,"Oncorhynchus","",3312.0824262524493,"Ceriodaphnia","",7770.4797554555653,null,"Salmo","",434.41001855057362,"Salvelinus","",638.17632596029205,"Daphnia","",985.25892001760678,"Lampsilis","",1026.1097707747783]
[null,"Site 431",1,100,7,null,1960.7253936241273,980,380," ","Daphnia","",2324.837284676019,"Micropterus","",2987.6319235481492,"Oncorhynchus","",3312.0824262524493,"Ceriodaphnia","",7770.4797554555653,null,"Salmo","",434.41001855057362,"Salvelinus","",638.17632596029205,"Daphnia","",985.25892001760678,"Lampsilis","",1026.1097707747783]
[null,"Site 432",1,100,7,null,1960.7253936241273,980,380," ","Daphnia","",2324.837284676019,"Micropterus","",2987.6319235481492,"Oncorhynchus","",3312.0824262524493,"Ceriodaphnia","",7770.4797554555653,null,"Salmo","",434.41001855057362,"Salvelinus","",638.17632596029205,"Daphnia","",985.25892001760678,"Lampsilis","",1026.1097707747783]
[null,"Site 433",1,100,7,null,1960.7253936241273,980,380," ","Daphnia","",2324.837284676019,"Micropterus","",2987.6319235481492,"Oncorhynchus","",3312.0824262524493,"Ceriodaphnia","",7770.4797554555653,null,"Salmo","",434.41001855057362,"Salvelinus","",638.17632596029205,"Daphnia","",985.25892001760678,"Lampsilis","",1026.1097707747783]
[null,"Site 434",1,100,7,null,1960.7253936241273,980,380," ","Daphnia","",2324.837284676019,"Micropterus","",2987.6319235481492,"Oncorhynchus","",3312.0824262524493,"Ceriodaphnia","",7770.4797554555653,null,"Salmo","",434.41001855057362,"Salvelinus","",638.17632596029205,"Daphnia","",985.25892001760678,"Lampsilis","",1026.1097707747783]
[null,"Site 435",1,100,7,null,1960.7253936241273,980,380," ","Daphnia","",2324.837284676019,"Micropterus","",2987.6319235481492,"Oncorhynchus","",3312.0824262524493,"Ceriodaphnia","",7770.4797554555653,null,"Salmo","",434.41001855057362,"Salvelinus","",638.17632596029205,"Daphnia","",985.25892001760678,"Lampsilis","",1026.1097707747783]
[null,"Site 436",1,100,7,null,1960.7253936241273,980,380," ","Daphnia","",2324.837284676019,"Micropterus","",2987.6319235481492,"Oncorhynchus","",3312.0824262524493,"Ceriodaphnia","",7770.4797554555653,null,"Salmo","",434.41001855057362,"Salvelinus","",638.17632596029205,"Daphnia","",985.25892001760678,"Lampsilis","",1026.1097707747783]
[null,"Site 437",1,100,7,null,1960.7253936241273,980,380," ","Daphnia","",2324.837284676019,"Micropterus","",2987.6319235481492,"Oncorhynchus","",3312.0824262524493,"Ceriodaphnia","",7770.4797554555653,null,"Salmo","",434.41001855057362,"Salvelinus","",638.17632596029205,"Daphnia","",985.25892001760678,"Lampsilis","",1026.1097707747783]
[null,"Site 438",1,100,7,null,1960.7253936241273,980,380," ","Daphnia","",2324.837284676019,"Micropterus","",2987.6319235481492,"Oncorhynchus","",3312.0824262524493,"Ceriodaphnia","",7770.4797554555653,null,"Salmo","",434.41001855057362,"Salvelinus","",638.17632596029205,"Daphnia","",985.25892001760678,"Lampsilis","",1026.1097707747783]
[null,"Site 439",1,100,7,null,1960.7253936241273,980,380," ","Daphnia","",2324.837284676019,"Micropterus","",2987.6319235481492,"Oncorhynchus","",3312.0824262524493,"Ceriodaphnia","",7770.4797554555653,null,"Salmo","",434.41001855057362,"Salvelinus","",638.17632596029205,"Daphnia","",985.25892001760678,"Lampsilis","",1026.1097707747783]
[null,"Site 440",1,100,7,null,1960.7253936241273,980,380," ","Daphnia","",2324.837284676019,"Micropterus","",2987.6319235481492,"Oncorhynchus","",3312.0824262524493,"Ceriodaphnia","",7770.4797554555653,null,"Salmo","",434.41001855057362,"Salvelinus","",638.17632596029205,"Daphnia","",985.25892001760678,"Lampsilis","",1026.1097707747783]
[null,"Site 441",1,100,7,null,1960.7253936241273,980,380," ","Daphnia","",2324.837284676019,"Micropterus","",2987.6319235481492,"Oncorhynchus","",3312.0824262524493,"Ceriodaphnia","",7770.4797554555653,null,"Salmo","",434.41001855057362,"Salvelinus","",638.17632596029205,"Daphnia","",985.25892001760678,"Lampsilis","",1026.1097707747783]
[null,"Site 442",1,100,7,null,1960.7253936241273,980,380," ","Daphnia","",2324.837284676019,"Micropterus","",2987.6319235481492,"Oncorhynchus","",3312.0824262524493,"Ceriodaphnia","",7770.4797554555653,null,"Salmo","",434.41001855057362,"Salvelinus","",638.17632596029205,"Daphnia","",985.25892001760678,"Lampsilis","",1026.1097707747783]
[null,"Site 443",1,100,7,null,1960.7253936241273,980,380," ","Daphnia","",2324.837284676019,"Micropterus","",2987.6319235481492,"Oncorhynchus","",3312.0824262524493,"Ceriodaphnia","",7770.4797554555653,null,"Salmo","",434.41001855057362,"Salvelinus","",638.17632596029205,"Daphnia","",985.25892001760678,"Lampsilis","",1026.1097707747783]
[null,"Site 444",1,100,7,null,1960.7253936241273,980,380," ","Daphnia","",2324.837284676019,"Micropterus","",2987.6319235481492,"Oncorhynchus","",3312.0824262524493,"Ceriodaphnia","",7770.4797554555653,null,"Salmo","",434.41001855057362,"Salvelinus","",638.17632596029205,"Daphnia","",985.25892001760678,"Lampsilis","",1026.1097707747783]
[null,"Site 445",1,100,7,null,1960.7253936241273,980,380," ","Daphnia","",2324.837284676019,"Micropterus","",2987.6319235481492,"Oncorhynchus","",3312.0824262524493,"Ceriodaphnia","",7770.4797554555653,null,"Salmo","",434.41001855057362,"Salvelinus","",638.17632596029205,"Daphnia","",985.25892001760678,"Lampsilis","",1026.1097707747783]
[null,"Site 446",1,100,7,null,1960.7253936241273,980,380," ","Daphnia","",2324.837284676019,"Micropterus","",2987.6319235481492,"Oncorhynchus","",3312.0824262524493,"Ceriodaphnia","",7770.4797554555653,null,"Salmo","",434.41001855057362,"Salvelinus","",638.17632596029205,"Daphnia","",985.25892001760678,"Lampsilis","",1026.1097707747783]
[null,"Site 447",1,100,7,null,1960.7253936241273,980,380," ","Daphnia","",2324.837284676019,"Micropterus","",2987.6319235481492,"Oncorhynchus","",3312.0824262524493,"Ceriodaphnia","",7770.4797554555653,null,"Salmo","",434.41001855057362,"Salvelinus","",638.17632596029205,"Daphnia","",985.25892001760678,"Lampsilis","",1026.1097707747783]
[null,"Site 448",1,100,7,null,1960.7253936241273,980,380," ","Daphnia","",2324.837284676019,"Micropterus","",2987.6319235481492,"Oncorhynchus","",3312.0824262524493,"Ceriodaphnia","",7770.4797554555653,null,"Salmo","",434.41001855057362,"Salvelinus","",638.17632596029205,"Daphnia","",985.25892001760678,"Lampsilis","",1026.1097707747783]
[null,"Site 449",1,100,7,null,1960.7253936241273,980,380," ","Daphnia","",2324.837284676019,"Micropterus","",2987.6319235481492,"Oncorhynchus","",3312.0824262524493,"Ceriodaphnia","",7770.4797554555653,null,"Salmo","",434.41001855057362,"Salvelinus","",638.17632596029205,"Daphnia","",985.25892001760678,"Lampsilis","",1026.1097707747783]
[null,"Site 450",1,100,7,null,1960.7253936241273,980,380,{"$f":"IF(OR(C459>12,D459>430,E459<6,E459>8.2),\"Outside model inputs\",\" \")","v":" "},"Daphnia","",2324.837284676019,"Micropterus","",2987.6319235481492,"Oncorhynchus","",3312.0824262524493,"Ceriodaphnia","",7770.4797554555653,null,"Salmo","",434.41001855057362,"Salvelinus","",638.17632596029205,"Daphnia","",985.25892001760678,"Lampsilis","",1026.1097707747783]
[null,"Site 451",1,100,7,null,1960.7253936241273,980,380," ","Daphnia","",2324.837284676019,"Micropterus","",2987.6319235481492,"Oncorhynchus","",3312.0824262524493,"Ceriodaphnia","",7770.4797554555653,null,"Salmo","",434.41001855057362,"Salvelinus","",638.17632596029205,"Daphnia","",985.25892001760678,"Lampsilis","",1026.1097707747783]
[null,"Site 452",1,100,7,null,1960.7253936241273,980,380," ","Daphnia","",2324.837284676019,"Micropterus","",2987.6319235481492,"Oncorhynchus","",3312.0824262524493,"Ceriodaphnia","",7770.4797554555653,null,"Salmo","",434.41001855057362,"Salvelinus","",638.17632596029205,"Daphnia","",985.25892001760678,"Lampsilis","",1026.1097707747783]
[null,"Site 453",1,100,7,null,1960.7253936241273,980,380," ","Daphnia","",2324.837284676019,"Micropterus","",2987.6319235481492,"Oncorhynchus","",3312.0824262524493,"Ceriodaphnia","",7770.4797554555653,null,"Salmo","",434.41001855057362,"Salvelinus","",638.17632596029205,"Daphnia","",985.25892001760678,"Lampsilis","",1026.1097707747783]
[null,"Site 454",1,100,7,null,1960.7253936241273,980,380," ","Daphnia","",2324.837284676019,"Micropterus","",2987.6319235481492,"Oncorhynchus","",3312.0824262524493,"Ceriodaphnia","",7770.4797554555653,null,"Salmo","",434.41001855057362,"Salvelinus","",638.17632596029205,"Daphnia","",985.25892001760678,"Lampsilis","",1026.1097707747783]
[null,"Site 455",1,100,7,null,1960.7253936241273,980,380," ","Daphnia","",2324.837284676019,"Micropterus","",2987.6319235481492,"Oncorhynchus","",3312.0824262524493,"Ceriodaphnia","",7770.4797554555653,null,"Salmo","",434.41001855057362,"Salvelinus","",638.17632596029205,"Daphnia","",985.25892001760678,"Lampsilis","",1026.1097707747783]
[null,"Site 456",1,100,7,null,1960.7253936241273,980,380," ","Daphnia","",2324.837284676019,"Micropterus","",2987.6319235481492,"Oncorhynchus","",3312.0824262524493,"Ceriodaphnia","",7770.4797554555653,null,"Salmo","",434.41001855057362,"Salvelinus","",638.17632596029205,"Daphnia","",985.25892001760678,"Lampsilis","",1026.1097707747783]
[null,"Site 457",1,100,7,null,1960.7253936241273,980,380," ","Daphnia","",2324.837284676019,"Micropterus","",2987.6319235481492,"Oncorhynchus","",3312.0824262524493,"Ceriodaphnia","",7770.4797554555653,null,"Salmo","",434.41001855057362,"Salvelinus","",638.17632596029205,"Daphnia","",985.25892001760678,"Lampsilis","",1026.1097707747783]
[null,"Site 458",1,100,7,null,1960.7253936241273,980,380," ","Daphnia","",2324.837284676019,"Micropterus","",2987.6319235481492,"Oncorhynchus","",3312.0824262524493,"Ceriodaphnia","",7770.4797554555653,null,"Salmo","",434.41001855057362,"Salvelinus","",638.17632596029205,"Daphnia","",985.25892001760678,"Lampsilis","",1026.1097707747783]
[null,"Site 459",1,100,7,null,1960.7253936241273,980,380," ","Daphnia","",2324.837284676019,"Micropterus","",2987.6319235481492,"Oncorhynchus","",3312.0824262524493,"Ceriodaphnia","",7770.4797554555653,null,"Salmo","",434.41001855057362,"Salvelinus","",638.17632596029205,"Daphnia","",985.25892001760678,"Lampsilis","",1026.1097707747783]
[null,"Site 460",1,100,7,null,1960.7253936241273,980,380," ","Daphnia","",2324.837284676019,"Micropterus","",2987.6319235481492,"Oncorhynchus","",3312.0824262524493,"Ceriodaphnia","",7770.4797554555653,null,"Salmo","",434.41001855057362,"Salvelinus","",638.17632596029205,"Daphnia","",985.25892001760678,"Lampsilis","",1026.1097707747783]
[null,"Site 461",1,100,7,null,1960.7253936241273,980,380," ","Daphnia","",2324.837284676019,"Micropterus","",2987.6319235481492,"Oncorhynchus","",3312.0824262524493,"Ceriodaphnia","",7770.4797554555653,null,"Salmo","",434.41001855057362,"Salvelinus","",638.17632596029205,"Daphnia","",985.25892001760678,"Lampsilis","",1026.1097707747783]
[null,"Site 462",1,100,7,null,1960.7253936241273,980,380," ","Daphnia","",2324.837284676019,"Micropterus","",2987.6319235481492,"Oncorhynchus","",3312.0824262524493,"Ceriodaphnia","",7770.4797554555653,null,"Salmo","",434.41001855057362,"Salvelinus","",638.17632596029205,"Daphnia","",985.25892001760678,"Lampsilis","",1026.1097707747783]
[null,"Site 463",1,100,7,null,1960.7253936241273,980,380," ","Daphnia","",2324.837284676019,"Micropterus","",2987.6319235481492,"Oncorhynchus","",3312.0824262524493,"Ceriodaphnia","",7770.4797554555653,null,"Salmo","",434.41001855057362,"Salvelinus","",638.17632596029205,"Daphnia","",985.25892001760678,"Lampsilis","",1026.1097707747783]
[null,"Site 464",1,100,7,null,1960.7253936241273,980,380," ","Daphnia","",2324.837284676019,"Micropterus","",2987.6319235481492,"Oncorhynchus","",3312.0824262524493,"Ceriodaphnia","",7770.4797554555653,null,"Salmo","",434.41001855057362,"Salvelinus","",638.17632596029205,"Daphnia","",985.25892001760678,"Lampsilis","",1026.1097707747783]
[null,"Site 465",1,100,7,null,1960.7253936241273,980,380," ","Daphnia","",2324.837284676019,"Micropterus","",2987.6319235481492,"Oncorhynchus","",3312.0824262524493,"Ceriodaphnia","",7770.4797554555653,null,"Salmo","",434.41001855057362,"Salvelinus","",638.17632596029205,"Daphnia","",985.25892001760678,"Lampsilis","",1026.1097707747783]
[null,"Site 466",1,100,7,null,1960.7253936241273,980,380," ","Daphnia","",2324.837284676019,"Micropterus","",2987.6319235481492,"Oncorhynchus","",3312.0824262524493,"Ceriodaphnia","",7770.4797554555653,null,"Salmo","",434.41001855057362,"Salvelinus","",638.17632596029205,"Daphnia","",985.25892001760678,"Lampsilis","",1026.1097707747783]
[null,"Site 467",1,100,7,null,1960.7253936241273,980,380," ","Daphnia","",2324.837284676019,"Micropterus","",2987.6319235481492,"Oncorhynchus","",3312.0824262524493,"Ceriodaphnia","",7770.4797554555653,null,"Salmo","",434.41001855057362,"Salvelinus","",638.17632596029205,"Daphnia","",985.25892001760678,"Lampsilis","",1026.1097707747783]
[null,"Site 468",1,100,7,null,1960.7253936241273,980,380," ","Daphnia","",2324.837284676019,"Micropterus","",2987.6319235481492,"Oncorhynchus","",3312.0824262524493,"Ceriodaphnia","",7770.4797554555653,null,"Salmo","",434.41001855057362,"Salvelinus","",638.17632596029205,"Daphnia","",985.25892001760678,"Lampsilis","",1026.1097707747783]
[null,"Site 469",1,100,7,null,1960.7253936241273,980,380," ","Daphnia","",2324.837284676019,"Micropterus","",2987.6319235481492,"Oncorhynchus","",3312.0824262524493,"Ceriodaphnia","",7770.4797554555653,null,"Salmo","",434.41001855057362,"Salvelinus","",638.17632596029205,"Daphnia","",985.25892001760678,"Lampsilis","",1026.1097707747783]
[null,"Site 470",1,100,7,null,1960.7253936241273,980,380," ","Daphnia","",2324.837284676019,"Micropterus","",2987.6319235481492,"Oncorhynchus","",3312.0824262524493,"Ceriodaphnia","",7770.4797554555653,null,"Salmo","",434.41001855057362,"Salvelinus","",638.17632596029205,"Daphnia","",985.25892001760678,"Lampsilis","",1026.1097707747783]
[null,"Site 471",1,100,7,null,1960.7253936241273,980,380," ","Daphnia","",2324.837284676019,"Micropterus","",2987.6319235481492,"Oncorhynchus","",3312.0824262524493,"Ceriodaphnia","",7770.4797554555653,null,"Salmo","",434.41001855057362,"Salvelinus","",638.17632596029205,"Daphnia","",985.25892001760678,"Lampsilis","",1026.1097707747783]
[null,"Site 472",1,100,7,null,1960.7253936241273,980,380," ","Daphnia","",2324.837284676019,"Micropterus","",2987.6319235481492,"Oncorhynchus","",3312.0824262524493,"Ceriodaphnia","",7770.4797554555653,null,"Salmo","",434.41001855057362,"Salvelinus","",638.17632596029205,"Daphnia","",985.25892001760678,"Lampsilis","",1026.1097707747783]
[null,"Site 473",1,100,7,null,1960.7253936241273,980,380," ","Daphnia","",2324.837284676019,"Micropterus","",2987.6319235481492,"Oncorhynchus","",3312.0824262524493,"Ceriodaphnia","",7770.4797554555653,null,"Salmo","",434.41001855057362,"Salvelinus","",638.17632596029205,"Daphnia","",985.25892001760678,"Lampsilis","",1026.1097707747783]
[null,"Site 474",1,100,7,null,1960.7253936241273,980,380," ","Daphnia","",2324.837284676019,"Micropterus","",2987.6319235481492,"Oncorhynchus","",3312.0824262524493,"Ceriodaphnia","",7770.4797554555653,null,"Salmo","",434.41001855057362,"Salvelinus","",638.17632596029205,"Daphnia","",985.25892001760678,"Lampsilis","",1026.1097707747783]
[null,"Site 475",1,100,7,null,1960.7253936241273,980,380," ","Daphnia","",2324.837284676019,"Micropterus","",2987.6319235481492,"Oncorhynchus","",3312.0824262524493,"Ceriodaphnia","",7770.4797554555653,null,"Salmo","",434.41001855057362,"Salvelinus","",638.17632596029205,"Daphnia","",985.25892001760678,"Lampsilis","",1026.1097707747783]
[null,"Site 476",1,100,7,null,1960.7253936241273,980,380," ","Daphnia","",2324.837284676019,"Micropterus","",2987.6319235481492,"Oncorhynchus","",3312.0824262524493,"Ceriodaphnia","",7770.4797554555653,null,"Salmo","",434.41001855057362,"Salvelinus","",638.17632596029205,"Daphnia","",985.25892001760678,"Lampsilis","",1026.1097707747783]
[null,"Site 477",1,100,7,null,1960.7253936241273,980,380," ","Daphnia","",2324.837284676019,"Micropterus","",2987.6319235481492,"Oncorhynchus","",3312.0824262524493,"Ceriodaphnia","",7770.4797554555653,null,"Salmo","",434.41001855057362,"Salvelinus","",638.17632596029205,"Daphnia","",985.25892001760678,"Lampsilis","",1026.1097707747783]
[null,"Site 478",1,100,7,null,1960.7253936241273,980,380," ","Daphnia","",2324.837284676019,"Micropterus","",2987.6319235481492,"Oncorhynchus","",3312.0824262524493,"Ceriodaphnia","",7770.4797554555653,null,"Salmo","",434.41001855057362,"Salvelinus","",638.17632596029205,"Daphnia","",985.25892001760678,"Lampsilis","",1026.1097707747783]
[null,"Site 479",1,100,7,null,1960.7253936241273,980,380," ","Daphnia","",2324.837284676019,"Micropterus","",2987.6319235481492,"Oncorhynchus","",3312.0824262524493,"Ceriodaphnia","",7770.4797554555653,null,"Salmo","",434.41001855057362,"Salvelinus","",638.17632596029205,"Daphnia","",985.25892001760678,"Lampsilis","",1026.1097707747783]
[null,"Site 480",1,100,7,null,1960.7253936241273,980,380," ","Daphnia","",2324.837284676019,"Micropterus","",2987.6319235481492,"Oncorhynchus","",3312.0824262524493,"Ceriodaphnia","",7770.4797554555653,null,"Salmo","",434.41001855057362,"Salvelinus","",638.17632596029205,"Daphnia","",985.25892001760678,"Lampsilis","",1026.1097707747783]
[null,"Site 481",1,100,7,null,1960.7253936241273,980,380," ","Daphnia","",2324.837284676019,"Micropterus","",2987.6319235481492,"Oncorhynchus","",3312.0824262524493,"Ceriodaphnia","",7770.4797554555653,null,"Salmo","",434.41001855057362,"Salvelinus","",638.17632596029205,"Daphnia","",985.25892001760678,"Lampsilis","",1026.1097707747783]
[null,"Site 482",1,100,7,null,1960.7253936241273,980,380," ","Daphnia","",2324.837284676019,"Micropterus","",2987.6319235481492,"Oncorhynchus","",3312.0824262524493,"Ceriodaphnia","",7770.4797554555653,null,"Salmo","",434.41001855057362,"Salvelinus","",638.17632596029205,"Daphnia","",985.25892001760678,"Lampsilis","",1026.1097707747783]
[null,"Site 483",1,100,7,null,1960.7253936241273,980,380," ","Daphnia","",2324.837284676019,"Micropterus","",2987.6319235481492,"Oncorhynchus","",3312.0824262524493,"Ceriodaphnia","",7770.4797554555653,null,"Salmo","",434.41001855057362,"Salvelinus","",638.17632596029205,"Daphnia","",985.25892001760678,"Lampsilis","",1026.1097707747783]
[null,"Site 484",1,100,7,null,1960.7253936241273,980,380," ","Daphnia","",2324.837284676019,"Micropterus","",2987.6319235481492,"Oncorhynchus","",3312.0824262524493,"Ceriodaphnia","",7770.4797554555653,null,"Salmo","",434.41001855057362,"Salvelinus","",638.17632596029205,"Daphnia","",985.25892001760678,"Lampsilis","",1026.1097707747783]
[null,"Site 485",1,100,7,null,1960.7253936241273,980,380," ","Daphnia","",2324.837284676019,"Micropterus","",2987.6319235481492,"Oncorhynchus","",3312.0824262524493,"Ceriodaphnia","",7770.4797554555653,null,"Salmo","",434.41001855057362,"Salvelinus","",638.17632596029205,"Daphnia","",985.25892001760678,"Lampsilis","",1026.1097707747783]
[null,"Site 486",1,100,7,null,1960.7253936241273,980,380," ","Daphnia","",2324.837284676019,"Micropterus","",2987.6319235481492,"Oncorhynchus","",3312.0824262524493,"Ceriodaphnia","",7770.4797554555653,null,"Salmo","",434.41001855057362,"Salvelinus","",638.17632596029205,"Daphnia","",985.25892001760678,"Lampsilis","",1026.1097707747783]
[null,"Site 487",1,100,7,null,1960.7253936241273,980,380," ","Daphnia","",2324.837284676019,"Micropterus","",2987.6319235481492,"Oncorhynchus","",3312.0824262524493,"Ceriodaphnia","",7770.4797554555653,null,"Salmo","",434.41001855057362,"Salvelinus","",638.17632596029205,"Daphnia","",985.25892001760678,"Lampsilis","",1026.1097707747783]
[null,"Site 488",1,100,7,null,1960.7253936241273,980,380," ","Daphnia","",2324.837284676019,"Micropterus","",2987.6319235481492,"Oncorhynchus","",3312.0824262524493,"Ceriodaphnia","",7770.4797554555653,null,"Salmo","",434.41001855057362,"Salvelinus","",638.17632596029205,"Daphnia","",985.25892001760678,"Lampsilis","",1026.1097707747783]
[null,"Site 489",1,100,7,null,1960.7253936241273,980,380," ","Daphnia","",2324.837284676019,"Micropterus","",2987.6319235481492,"Oncorhynchus","",3312.0824262524493,"Ceriodaphnia","",7770.4797554555653,null,"Salmo","",434.41001855057362,"Salvelinus","",638.17632596029205,"Daphnia","",985.25892001760678,"Lampsilis","",1026.1097707747783]
[null,"Site 490",1,100,7,null,1960.7253936241273,980,380," ","Daphnia","",2324.837284676019,"Micropterus","",2987.6319235481492,"Oncorhynchus","",3312.0824262524493,"Ceriodaphnia","",7770.4797554555653,null,"Salmo","",434.41001855057362,"Salvelinus","",638.17632596029205,"Daphnia","",985.25892001760678,"Lampsilis","",1026.1097707747783]
[null,"Site 491",1,100,7,null,1960.7253936241273,980,380," ","Daphnia","",2324.837284676019,"Micropterus","",2987.6319235481492,"Oncorhynchus","",3312.0824262524493,"Ceriodaphnia","",7770.4797554555653,null,"Salmo","",434.41001855057362,"Salvelinus","",638.17632596029205,"Daphnia","",985.25892001760678,"Lampsilis","",1026.1097707747783]
[null,"Site 492",1,100,7,null,1960.7253936241273,980,380," ","Daphnia","",2324.837284676019,"Micropterus","",2987.6319235481492,"Oncorhynchus","",3312.0824262524493,"Ceriodaphnia","",7770.4797554555653,null,"Salmo","",434.41001855057362,"Salvelinus","",638.17632596029205,"Daphnia","",985.25892001760678,"Lampsilis","",1026.1097707747783]
[null,"Site 493",1,100,7,null,1960.7253936241273,980,380," ","Daphnia","",2324.837284676019,"Micropterus","",2987.6319235481492,"Oncorhynchus","",3312.0824262524493,"Ceriodaphnia","",7770.4797554555653,null,"Salmo","",434.41001855057362,"Salvelinus","",638.17632596029205,"Daphnia","",985.25892001760678,"Lampsilis","",1026.1097707747783]
[null,"Site 494",1,100,7,null,1960.7253936241273,980,380," ","Daphnia","",2324.837284676019,"Micropterus","",2987.6319235481492,"Oncorhynchus","",3312.0824262524493,"Ceriodaphnia","",7770.4797554555653,null,"Salmo","",434.41001855057362,"Salvelinus","",638.17632596029205,"Daphnia","",985.25892001760678,"Lampsilis","",1026.1097707747783]
[null,"Site 495",1,100,7,null,1960.7253936241273,980,380," ","Daphnia","",2324.837284676019,"Micropterus","",2987.6319235481492,"Oncorhynchus","",3312.0824262524493,"Ceriodaphnia","",7770.4797554555653,null,"Salmo","",434.41001855057362,"Salvelinus","",638.17632596029205,"Daphnia","",985.25892001760678,"Lampsilis","",1026.1097707747783]
[null,"Site 496",1,100,7,null,1960.7253936241273,980,380," ","Daphnia","",2324.837284676019,"Micropterus","",2987.6319235481492,"Oncorhynchus","",3312.0824262524493,"Ceriodaphnia","",7770.4797554555653,null,"Salmo","",434.41001855057362,"Salvelinus","",638.17632596029205,"Daphnia","",985.25892001760678,"Lampsilis","",1026.1097707747783]
[null,"Site 497",1,100,7,null,1960.7253936241273,980,380," ","Daphnia","",2324.837284676019,"Micropterus","",2987.6319235481492,"Oncorhynchus","",3312.0824262524493,"Ceriodaphnia","",7770.4797554555653,null,"Salmo","",434.41001855057362,"Salvelinus","",638.17632596029205,"Daphnia","",985.25892001760678,"Lampsilis","",1026.1097707747783]
[null,"Site 498",1,100,7,null,1960.7253936241273,980,380," ","Daphnia","",2324.837284676019,"Micropterus","",2987.6319235481492,"Oncorhynchus","",3312.0824262524493,"Ceriodaphnia","",7770.4797554555653,null,"Salmo","",434.41001855057362,"Salvelinus","",638.17632596029205,"Daphnia","",985.25892001760678,"Lampsilis","",1026.1097707747783]
[null,"Site 499",1,100,7,null,1960.7253936241273,980,380," ","Daphnia","",2324.837284676019,"Micropterus","",2987.6319235481492,"Oncorhynchus","",3312.0824262524493,"Ceriodaphnia","",7770.4797554555653,null,"Salmo","",434.41001855057362,"Salvelinus","",638.17632596029205,"Daphnia","",985.25892001760678,"Lampsilis","",1026.1097707747783]
[null,"Site 500",1,300,7,null,2829.2215246647734,1400,440,{"$f":"IF(OR(C509>12,D509>430,E509<6,E509>8.2),\"Outside model inputs\",\" \")","v":" "},"Micropterus","",3880.4487318846113,"Daphnia","",3934.8994852791047,"Oncorhynchus","",4301.8572500674654,"Salmo","",11224.133645324979,null,"Salmo","",564.22807385207557,"Salvelinus","",828.88741925423574,"Daphnia","",1667.5983488385039,"Lampsilis","",1736.7403884458131]

{"sheet":"Summary Sheet","index":3,"n_rows":44,"n_cols":20,"rows_kept":44,"cut":false,"hidden":false,"merged":[[2,1,2,2]]}
[]
[null,null,null,null,null,null,"All concentrations reported are µg/L total Aluminum"]
[null,"Normalization Chemistry"]
[null,"pH:",7,{"$f":"IF(OR(C4<5,C4>9),\"Outside model inputs\",\" \")","v":" "},null,null,"FAV",{"$f":"E43","v":2829.2215246647734}]
[null,"Total Hardness:",300,{"$f":"IF(C5>428,\"Outside model inputs\",\" \")","v":" "},null,null,"CMC",{"$f":"ROUND(E44,2-(1+INT(LOG10(ABS(E44)))))","v":1400}]
[null,"DOC:",1,{"$f":"IF(C6>12.3,\"Outside model inputs\",\" \")","v":" "},null,null,"CCC",{"$f":"ROUND(O43,2-(1+INT(LOG10(ABS(O43)))))","v":440}]
[]
[]
[null,"Acute Ranked GMAV",null,null,null,null,null,null,null,null,null,"Chronic Ranked GMCV"]
[null,"Rank",null,"GMAV","Genus",null,null,null,null,null,null,"Rank",null,"GMCV","Genus"]
[null,20,{"$f":"IF(VLOOKUP(D11,'Acute Dataset'!O$5:Q$143,2,)=\">\",\">\",\"\")","v":""},{"$f":"SMALL('Acute Dataset'!O$5:O$143,'Summary Sheet'!B11)","v":202135.99697737375},{"$f":"VLOOKUP(D11,'Acute Dataset'!O$5:Q$143,3,FALSE)","v":"Melanoides"},{"$f":"VLOOKUP(D11,'Acute Dataset'!O$5:R$143,4,FALSE)","v":"Mollusk"},null,null,null,null,null,13,{"$f":"IF(VLOOKUP(N11,'Chronic Dataset'!O$5:Q$76,2,FALSE) =\">\",\">\",\"\")","v":""},{"$f":"SMALL('Chronic Dataset'!$O$5:$O$76,L11)","v":34720.40938168201},{"$f":"VLOOKUP(N11,'Chronic Dataset'!O$5:Q$76,3,FALSE)","v":"Aeolosoma"},{"$f":"VLOOKUP(N11,'Chronic Dataset'!O$5:R$76,4,FALSE)","v":"Invert"}]
[null,19,{"$f":"IF(VLOOKUP(D12,'Acute Dataset'!O$5:Q$143,2,)=\">\",\">\",\"\")","v":">"},{"$f":"SMALL('Acute Dataset'!O$5:O$143,'Summary Sheet'!B12)","v":119573.57964259433},{"$f":"VLOOKUP(D12,'Acute Dataset'!O$5:Q$143,3,FALSE)","v":"Paratanytarsus"},{"$f":"VLOOKUP(D12,'Acute Dataset'!O$5:R$143,4,FALSE)","v":"Invert"},null,null,null,null,null,12,{"$f":"IF(VLOOKUP(N12,'Chronic Dataset'!O$5:Q$76,2,FALSE) =\">\",\">\",\"\")","v":">"},{"$f":"SMALL('Chronic Dataset'!$O$5:$O$76,L12)","v":13877.214663251772},{"$f":"VLOOKUP(N12,'Chronic Dataset'!O$5:Q$76,3,FALSE)","v":"Rana"},{"$f":"VLOOKUP(N12,'Chronic Dataset'!O$5:R$76,4,FALSE)","v":"Amphib - Other Data"}]
[null,18,{"$f":"IF(VLOOKUP(D13,'Acute Dataset'!O$5:Q$143,2,)=\">\",\">\",\"\")","v":""},{"$f":"SMALL('Acute Dataset'!O$5:O$143,'Summary Sheet'!B13)","v":70846.905401769967},{"$f":"VLOOKUP(D13,'Acute Dataset'!O$5:Q$143,3,FALSE)","v":"Physa"},{"$f":"VLOOKUP(D13,'Acute Dataset'!O$5:R$143,4,FALSE)","v":"Mollusk"},null,null,null,null,null,11,{"$f":"IF(VLOOKUP(N13,'Chronic Dataset'!O$5:Q$76,2,FALSE) =\">\",\">\",\"\")","v":""},{"$f":"SMALL('Chronic Dataset'!$O$5:$O$76,L13)","v":8630.4409557603212},{"$f":"VLOOKUP(N13,'Chronic Dataset'!O$5:Q$76,3,FALSE)","v":"Chironomus"},{"$f":"VLOOKUP(N13,'Chronic Dataset'!O$5:R$76,4,FALSE)","v":"Invert"}]
[null,17,{"$f":"IF(VLOOKUP(D14,'Acute Dataset'!O$5:Q$143,2,)=\">\",\">\",\"\")","v":">"},{"$f":"SMALL('Acute Dataset'!O$5:O$143,'Summary Sheet'!B14)","v":49916.991084267444},{"$f":"VLOOKUP(D14,'Acute Dataset'!O$5:Q$143,3,FALSE)","v":"Lampsilis"},{"$f":"VLOOKUP(D14,'Acute Dataset'!O$5:R$143,4,FALSE)","v":"Mollusk"},null,null,null,null,null,10,{"$f":"IF(VLOOKUP(N14,'Chronic Dataset'!O$5:Q$76,2,FALSE) =\">\",\">\",\"\")","v":""},{"$f":"SMALL('Chronic Dataset'!$O$5:$O$76,L14)","v":5990.0338819298604},{"$f":"VLOOKUP(N14,'Chronic Dataset'!O$5:Q$76,3,FALSE)","v":"Brachionus"},{"$f":"VLOOKUP(N14,'Chronic Dataset'!O$5:R$76,4,FALSE)","v":"Invert"}]
[null,16,{"$f":"IF(VLOOKUP(D15,'Acute Dataset'!O$5:Q$143,2,)=\">\",\">\",\"\")","v":">"},{"$f":"SMALL('Acute Dataset'!O$5:O$143,'Summary Sheet'!B15)","v":46995.139115055659},{"$f":"VLOOKUP(D15,'Acute Dataset'!O$5:Q$143,3,FALSE)","v":"Hyalella"},{"$f":"VLOOKUP(D15,'Acute Dataset'!O$5:R$143,4,FALSE)","v":"Invert"},null,null,null,null,null,9,{"$f":"IF(VLOOKUP(N15,'Chronic Dataset'!O$5:Q$76,2,FALSE) =\">\",\">\",\"\")","v":""},{"$f":"SMALL('Chronic Dataset'!$O$5:$O$76,L15)","v":5278.9568861662583},{"$f":"VLOOKUP(N15,'Chronic Dataset'!O$5:Q$76,3,FALSE)","v":"Lymnaea"},{"$f":"VLOOKUP(N15,'Chronic Dataset'!O$5:R$76,4,FALSE)","v":"Mollusk"}]
[null,15,{"$f":"IF(VLOOKUP(D16,'Acute Dataset'!O$5:Q$143,2,)=\">\",\">\",\"\")","v":""},{"$f":"SMALL('Acute Dataset'!O$5:O$143,'Summary Sheet'!B16)","v":42679.822277453961},{"$f":"VLOOKUP(D16,'Acute Dataset'!O$5:Q$143,3,FALSE)","v":"Chironomus"},{"$f":"VLOOKUP(D16,'Acute Dataset'!O$5:R$143,4,FALSE)","v":"Invert"},null,null,null,null,null,8,{"$f":"IF(VLOOKUP(N16,'Chronic Dataset'!O$5:Q$76,2,FALSE) =\">\",\">\",\"\")","v":""},{"$f":"SMALL('Chronic Dataset'!$O$5:$O$76,L16)","v":3126.0189868616699},{"$f":"VLOOKUP(N16,'Chronic Dataset'!O$5:Q$76,3,FALSE)","v":"Pimephales"},{"$f":"VLOOKUP(N16,'Chronic Dataset'!O$5:R$76,4,FALSE)","v":"Fish"}]
[null,14,{"$f":"IF(VLOOKUP(D17,'Acute Dataset'!O$5:Q$143,2,)=\">\",\">\",\"\")","v":">"},{"$f":"SMALL('Acute Dataset'!O$5:O$143,'Summary Sheet'!B17)","v":40376.770338445283},{"$f":"VLOOKUP(D17,'Acute Dataset'!O$5:Q$143,3,FALSE)","v":"Lepomis"},{"$f":"VLOOKUP(D17,'Acute Dataset'!O$5:R$143,4,FALSE)","v":"Fish"},null,null,null,null,null,7,{"$f":"IF(VLOOKUP(N17,'Chronic Dataset'!O$5:Q$76,2,FALSE) =\">\",\">\",\"\")","v":""},{"$f":"SMALL('Chronic Dataset'!$O$5:$O$76,L17)","v":2347.888949900866},{"$f":"VLOOKUP(N17,'Chronic Dataset'!O$5:Q$76,3,FALSE)","v":"Hyalella"},{"$f":"VLOOKUP(N17,'Chronic Dataset'!O$5:R$76,4,FALSE)","v":"Invert"}]
[null,13,{"$f":"IF(VLOOKUP(D18,'Acute Dataset'!O$5:Q$143,2,)=\">\",\">\",\"\")","v":">"},{"$f":"SMALL('Acute Dataset'!O$5:O$143,'Summary Sheet'!B18)","v":28698.428126809416},{"$f":"VLOOKUP(D18,'Acute Dataset'!O$5:Q$143,3,FALSE)","v":"Pimephales"},{"$f":"VLOOKUP(D18,'Acute Dataset'!O$5:R$143,4,FALSE)","v":"Fish"},null,null,null,null,null,6,{"$f":"IF(VLOOKUP(N18,'Chronic Dataset'!O$5:Q$76,2,FALSE) =\">\",\">\",\"\")","v":""},{"$f":"SMALL('Chronic Dataset'!$O$5:$O$76,L18)","v":1999.7504489656797},{"$f":"VLOOKUP(N18,'Chronic Dataset'!O$5:Q$76,3,FALSE)","v":"Ceriodaphnia"},{"$f":"VLOOKUP(N18,'Chronic Dataset'!O$5:R$76,4,FALSE)","v":"Invert"}]
[null,12,{"$f":"IF(VLOOKUP(D19,'Acute Dataset'!O$5:Q$143,2,)=\">\",\">\",\"\")","v":">"},{"$f":"SMALL('Acute Dataset'!O$5:O$143,'Summary Sheet'!B19)","v":28287.133948670376},{"$f":"VLOOKUP(D19,'Acute Dataset'!O$5:Q$143,3,FALSE)","v":"Hybognathus"},{"$f":"VLOOKUP(D19,'Acute Dataset'!O$5:R$143,4,FALSE)","v":"Fish"},null,null,null,null,null,5,{"$f":"IF(VLOOKUP(N19,'Chronic Dataset'!O$5:Q$76,2,FALSE) =\">\",\">\",\"\")","v":""},{"$f":"SMALL('Chronic Dataset'!$O$5:$O$76,L19)","v":1743.0883001766804},{"$f":"VLOOKUP(N19,'Chronic Dataset'!O$5:Q$76,3,FALSE)","v":"Danio"},{"$f":"VLOOKUP(N19,'Chronic Dataset'!O$5:R$76,4,FALSE)","v":"Fish"}]
[null,11,{"$f":"IF(VLOOKUP(D20,'Acute Dataset'!O$5:Q$143,2,)=\">\",\">\",\"\")","v":""},{"$f":"SMALL('Acute Dataset'!O$5:O$143,'Summary Sheet'!B20)","v":24564.302681408841},{"$f":"VLOOKUP(D20,'Acute Dataset'!O$5:Q$143,3,FALSE)","v":"Salvelinus"},{"$f":"VLOOKUP(D20,'Acute Dataset'!O$5:R$143,4,FALSE)","v":"Fish"},null,null,null,null,null,4,{"$f":"IF(VLOOKUP(N20,'Chronic Dataset'!O$5:Q$76,2,FALSE) =\">\",\">\",\"\")","v":""},{"$f":"SMALL('Chronic Dataset'!$O$5:$O$76,L20)","v":1736.7403884458131},{"$f":"VLOOKUP(N20,'Chronic Dataset'!O$5:Q$76,3,FALSE)","v":"Lampsilis"},{"$f":"VLOOKUP(N20,'Chronic Dataset'!O$5:R$76,4,FALSE)","v":"Mollusk"}]
[null,10,{"$f":"IF(VLOOKUP(D21,'Acute Dataset'!O$5:Q$143,2,)=\">\",\">\",\"\")","v":">"},{"$f":"SMALL('Acute Dataset'!O$5:O$143,'Summary Sheet'!B21)","v":24109.706698213042},{"$f":"VLOOKUP(D21,'Acute Dataset'!O$5:Q$143,3,FALSE)","v":"Hyla"},{"$f":"VLOOKUP(D21,'Acute Dataset'!O$5:R$143,4,FALSE)","v":"Amphibian"},null,null,null,null,null,3,{"$f":"IF(VLOOKUP(N21,'Chronic Dataset'!O$5:Q$76,2,FALSE) =\">\",\">\",\"\")","v":""},{"$f":"SMALL('Chronic Dataset'!$O$5:$O$76,L21)","v":1667.5983488385039},{"$f":"VLOOKUP(N21,'Chronic Dataset'!O$5:Q$76,3,FALSE)","v":"Daphnia"},{"$f":"VLOOKUP(N21,'Chronic Dataset'!O$5:R$76,4,FALSE)","v":"Invert"}]
[null,9,{"$f":"IF(VLOOKUP(D22,'Acute Dataset'!O$5:Q$143,2,)=\">\",\">\",\"\")","v":""},{"$f":"SMALL('Acute Dataset'!O$5:O$143,'Summary Sheet'!B22)","v":21835.186596560488},{"$f":"VLOOKUP(D22,'Acute Dataset'!O$5:Q$143,3,FALSE)","v":"Crangonyx"},{"$f":"VLOOKUP(D22,'Acute Dataset'!O$5:R$143,4,FALSE)","v":"Invert"},null,null,null,null,null,2,{"$f":"IF(VLOOKUP(N22,'Chronic Dataset'!O$5:Q$76,2,FALSE) =\">\",\">\",\"\")","v":""},{"$f":"SMALL('Chronic Dataset'!$O$5:$O$76,L22)","v":828.88741925423574},{"$f":"VLOOKUP(N22,'Chronic Dataset'!O$5:Q$76,3,FALSE)","v":"Salvelinus"},{"$f":"VLOOKUP(N22,'Chronic Dataset'!O$5:R$76,4,FALSE)","v":"Fish"}]
[null,8,{"$f":"IF(VLOOKUP(D23,'Acute Dataset'!O$5:Q$143,2,)=\">\",\">\",\"\")","v":""},{"$f":"SMALL('Acute Dataset'!O$5:O$143,'Summary Sheet'!B23)","v":15611.401397591006},{"$f":"VLOOKUP(D23,'Acute Dataset'!O$5:Q$143,3,FALSE)","v":"Nais"},{"$f":"VLOOKUP(D23,'Acute Dataset'!O$5:R$143,4,FALSE)","v":"Invert"},null,null,null,null,null,1,{"$f":"IF(VLOOKUP(N23,'Chronic Dataset'!O$5:Q$76,2,FALSE) =\">\",\">\",\"\")","v":""},{"$f":"SMALL('Chronic Dataset'!$O$5:$O$76,L23)","v":564.22807385207557},{"$f":"VLOOKUP(N23,'Chronic Dataset'!O$5:Q$76,3,FALSE)","v":"Salmo"},{"$f":"VLOOKUP(N23,'Chronic Dataset'!O$5:R$76,4,FALSE)","v":"Fish"},null,null," "]
[null,7,{"$f":"IF(VLOOKUP(D24,'Acute Dataset'!O$5:Q$143,2,)=\">\",\">\",\"\")","v":""},{"$f":"SMALL('Acute Dataset'!O$5:O$143,'Summary Sheet'!B24)","v":13540.118913211649},{"$f":"VLOOKUP(D24,'Acute Dataset'!O$5:Q$143,3,FALSE)","v":"Stenocypris"},{"$f":"VLOOKUP(D24,'Acute Dataset'!O$5:R$143,4,FALSE)","v":"Invert"}]
[null,6,{"$f":"IF(VLOOKUP(D25,'Acute Dataset'!O$5:Q$143,2,)=\">\",\">\",\"\")","v":""},{"$f":"SMALL('Acute Dataset'!O$5:O$143,'Summary Sheet'!B25)","v":13151.91260552015},{"$f":"VLOOKUP(D25,'Acute Dataset'!O$5:Q$143,3,FALSE)","v":"Ceriodaphnia"},{"$f":"VLOOKUP(D25,'Acute Dataset'!O$5:R$143,4,FALSE)","v":"Invert"}]
[null,5,{"$f":"IF(VLOOKUP(D26,'Acute Dataset'!O$5:Q$143,2,)=\">\",\">\",\"\")","v":""},{"$f":"SMALL('Acute Dataset'!O$5:O$143,'Summary Sheet'!B26)","v":11768.626281177572},{"$f":"VLOOKUP(D26,'Acute Dataset'!O$5:Q$143,3,FALSE)","v":"Poecilia"},{"$f":"VLOOKUP(D26,'Acute Dataset'!O$5:R$143,4,FALSE)","v":"Fish"}]
[null,4,{"$f":"IF(VLOOKUP(D27,'Acute Dataset'!O$5:Q$143,2,)=\">\",\">\",\"\")","v":""},{"$f":"SMALL('Acute Dataset'!O$5:O$143,'Summary Sheet'!B27)","v":11224.133645324979},{"$f":"VLOOKUP(D27,'Acute Dataset'!O$5:Q$143,3,FALSE)","v":"Salmo"},{"$f":"VLOOKUP(D27,'Acute Dataset'!O$5:R$143,4,FALSE)","v":"Fish"}]
[null,3,{"$f":"IF(VLOOKUP(D28,'Acute Dataset'!O$5:Q$143,2,)=\">\",\">\",\"\")","v":""},{"$f":"SMALL('Acute Dataset'!O$5:O$143,'Summary Sheet'!B28)","v":4301.8572500674654},{"$f":"VLOOKUP(D28,'Acute Dataset'!O$5:Q$143,3,FALSE)","v":"Oncorhynchus"},{"$f":"VLOOKUP(D28,'Acute Dataset'!O$5:R$143,4,FALSE)","v":"Fish"}]
[null,2,{"$f":"IF(VLOOKUP(D29,'Acute Dataset'!O$5:Q$143,2,)=\">\",\">\",\"\")","v":""},{"$f":"SMALL('Acute Dataset'!O$5:O$143,'Summary Sheet'!B29)","v":3934.8994852791047},{"$f":"VLOOKUP(D29,'Acute Dataset'!O$5:Q$143,3,FALSE)","v":"Daphnia"},{"$f":"VLOOKUP(D29,'Acute Dataset'!O$5:R$143,4,FALSE)","v":"Invert"}]
[null,1,{"$f":"IF(VLOOKUP(D30,'Acute Dataset'!O$5:Q$143,2,)=\">\",\">\",\"\")","v":""},{"$f":"SMALL('Acute Dataset'!O$5:O$143,'Summary Sheet'!B30)","v":3880.4487318846113},{"$f":"VLOOKUP(D30,'Acute Dataset'!O$5:Q$143,3,FALSE)","v":"Micropterus"},{"$f":"VLOOKUP(D30,'Acute Dataset'!O$5:R$143,4,FALSE)","v":"Fish"}]
[]
[]
[null,null,"N","Rank","Genus","GMAV","ln(GMAV)","ln(GMAV)2","P=R/(N+1)","sqrt(P)",null,null,"N","Rank","Genus","GMCV","ln(GMCV)","ln(GMCV)2","P=R/(N+1)","sqrt(P)"]
[null,null,20,4,{"$f":"E27","v":"Salmo"},{"$f":"D27","v":11224.133645324979},{"$f":"LN(F34)","v":9.3258215288144886},{"$f":"G34^2","v":86.970947187299799},{"$f":"D34 / (C34+1)","v":0.19047619047619047},{"$f":"SQRT(I34)","v":0.43643578047198472},null,null,13,4,{"$f":"O20","v":"Lampsilis"},{"$f":"N20","v":1736.7403884458131},{"$f":"LN(P34)","v":7.4597652953390572},{"$f":"Q34^2","v":55.648098261545009},{"$f":"N34 / (M34+1)","v":0.2857142857142857},{"$f":"SQRT(S34)","v":0.53452248382484879}]
[null,null,null,3,{"$f":"E28","v":"Oncorhynchus"},{"$f":"D28","v":4301.8572500674654},{"$f":"LN(F35)","v":8.3668021270519972},{"$f":"G35^2","v":70.003377833241828},{"$f":"D35 / (C34+1)","v":0.14285714285714285},{"$f":"SQRT(I35)","v":0.3779644730092272},null,null,null,3,{"$f":"O21","v":"Daphnia"},{"$f":"N21","v":1667.5983488385039},{"$f":"LN(P35)","v":7.4191397558637338},{"$f":"Q35^2","v":55.043634717037783},{"$f":"N35 / (M34+1)","v":0.21428571428571427},{"$f":"SQRT(S35)","v":0.46291004988627571}]
[null,null,null,2,{"$f":"E29","v":"Daphnia"},{"$f":"D29","v":3934.8994852791047},{"$f":"LN(F36)","v":8.277640616758827},{"$f":"G36^2","v":68.519334180215452},{"$f":"D36 / (C34+1)","v":9.5238095238095233E-2},{"$f":"SQRT(I36)","v":0.30860669992418382},null,null,null,2,{"$f":"O22","v":"Salvelinus"},{"$f":"N22","v":828.88741925423574},{"$f":"LN(P36)","v":6.7200843428423376},{"$f":"Q36^2","v":45.159533574914732},{"$f":"N36 / (M34+1)","v":0.14285714285714285},{"$f":"SQRT(S36)","v":0.3779644730092272}]
[null,null,null,1,{"$f":"E30","v":"Micropterus"},{"$f":"D30","v":3880.4487318846113},{"$f":"LN(F37)","v":8.263706078477659},{"$f":"G37^2","v":68.28883815146861},{"$f":"D37 / (C34+1)","v":4.7619047619047616E-2},{"$f":"SQRT(I37)","v":0.21821789023599236},null,null,null,1,{"$f":"O23","v":"Salmo"},{"$f":"N23","v":564.22807385207557},{"$f":"LN(P37)","v":6.3354585560185157},{"$f":"Q37^2","v":40.138035115028217},{"$f":"N37 / (M34+1)","v":7.1428571428571425E-2},{"$f":"SQRT(S37)","v":0.2672612419124244}]
[null,null,null,"Sum:",null,null,{"$f":"SUM(G34:G37)","v":34.233970351102968},{"$f":"SUM(H34:H37)","v":293.78249735222573},{"$f":"SUM(I34:I37)","v":0.47619047619047616},{"$f":"SUM(J34:J37)","v":1.3412248436413881},null,null,null,"Sum:",null,null,{"$f":"SUM(Q34:Q37)","v":27.934447950063642},{"$f":"SUM(R34:R37)","v":195.98930166852574},{"$f":"SUM(S34:S37)","v":0.71428571428571419},{"$f":"SUM(T34:T37)","v":1.6426582486327761}]
[]
[null,null,null,"S2 =",{"$f":"(H38 - ((G38^2)/4)) / (I38 - ((J38^2)/4))","v":29.89543326682649},null,null,null,null,null,null,null,null,"S2 =",{"$f":"(R38 - ((Q38^2)/4)) / (S38 - ((T38^2)/4))","v":22.817648225135336}]
[null,null,null,"L =",{"$f":" (G38 - (SQRT(E40) * J38)) / 4","v":6.7251483244775034},null,null,null,null,null,null,null,null,"L =",{"$f":" (Q38 - (SQRT(O40) * T38)) / 4","v":5.021956815155785}]
[null,null,null,"A =",{"$f":" (SQRT(E40) * SQRT(0.05)) + E41","v":7.9477568731721888},null,null,null,null,null,null,null,null,"A =",{"$f":" (SQRT(O40) * SQRT(0.05)) + O41","v":6.0900777873573269}]
[null,null,null,"FAV =",{"$f":" EXP(E42)","v":2829.2215246647734},null,null,null,null,null,null,null,null,"FCV =",{"$f":" EXP(O42)","v":441.45574948653831}]
[null,null,null,"CMC =",{"$f":"E43/2","v":1414.6107623323867}]

{"sheet":"Acute Dataset","index":4,"n_rows":150,"n_cols":20,"rows_kept":150,"cut":false,"hidden":false,"merged":[]}
[null,"Appendix A. Acceptable Acute Toxicity Data of Aluminum to Freshwater Aquatic Animals"]
[null,null,null,null,null,null,null,null,null,null,"Values in bold used in SMAV calculation"]
[null,"Species","Methoda","Total Hardness (mg/L as CaCO3)","pH","DOC\n(mg/L)",null,"LC50 or EC50 Conc. (µg/L)","Reference",null,"Normalized Conc. - LC50\n(µg/L)","Reason excluded from SMAV",null,"Species Mean Acute Value\n(µg/L)","Genus Mean Acute Value\n(µg/L)",null,"Genus",null,"DOC Note","Dilution water"]
[]
[null,"Worm, Nais elinguis","R, M, T",17.89,6.51,3.2,null,3874,"Shuhaimi-Othman et al. 2012a, 2013",null,{"$f":"EXP(LN(H5)-0.597*(LN(F5)-LN('Summary Sheet'!$C$6))-8.802*(E5-'Summary Sheet'!$C$4)-2.089*(LN(D5)-LN('Summary Sheet'!$C$5))+0.491*(E5^2-'Summary Sheet'!$C$4^2)+0.23*((E5*LN(D5)-'Summary Sheet'!$C$4*LN('Summary Sheet'!$C$5))))","v":15611.401397591006},null,null,{"$f":"GEOMEAN(K5)","v":15611.401397591006},{"$f":"N5","v":15611.401397591006},null,"Nais","Invert","Value is from Shuhaimi-Othman et al. 2013","Tap water (Malaysia)"]
[]
[null,"Snail, Physa sp. ","S, M, T",47.4,6.59,1.1000000000000001,">",23400,"Call 1984; Call et al. 1984",">",{"$f":"EXP(LN(H7)-0.597*(LN(F7)-LN('Summary Sheet'!$C$6))-8.802*(E7-'Summary Sheet'!$C$4)-2.089*(LN(D7)-LN('Summary Sheet'!$C$5))+0.491*(E7^2-'Summary Sheet'!$C$4^2)+0.23*((E7*LN(D7)-'Summary Sheet'!$C$4*LN('Summary Sheet'!$C$5))))","v":89016.044313163467},null,null,"-",null,null,"Physa",null,"Value is from 2007 FW Cu AWQC Appendix C recommendation","Raw Lake Superior water"]
[null,"Snail, Physa sp. ","S, M, T",47.4,7.55,1.1000000000000001,null,30600,"Call 1984; Call et al. 1984",null,{"$f":"EXP(LN(H8)-0.597*(LN(F8)-LN('Summary Sheet'!$C$6))-8.802*(E8-'Summary Sheet'!$C$4)-2.089*(LN(D8)-LN('Summary Sheet'!$C$5))+0.491*(E8^2-'Summary Sheet'!$C$4^2)+0.23*((E8*LN(D8)-'Summary Sheet'!$C$4*LN('Summary Sheet'!$C$5))))","v":45794.994802424},null,null,"-",null,null,"Physa",null,"Value is from 2007 FW Cu AWQC Appendix C recommendation","Raw Lake Superior water"]
[null,"Snail, Physa sp. ","S, M, T",47.4,8.17,1.1000000000000001,">",24700,"Call 1984; Call et al. 1984",">",{"$f":"EXP(LN(H9)-0.597*(LN(F9)-LN('Summary Sheet'!$C$6))-8.802*(E9-'Summary Sheet'!$C$4)-2.089*(LN(D9)-LN('Summary Sheet'!$C$5))+0.491*(E9^2-'Summary Sheet'!$C$4^2)+0.23*((E9*LN(D9)-'Summary Sheet'!$C$4*LN('Summary Sheet'!$C$5))))","v":32735.495086367009},"c",null,"-",null,null,"Physa",null,"Value is from 2007 FW Cu AWQC Appendix C recommendation","Raw Lake Superior water"]
[null,"Snail, Physa sp. ","S, M, T",47.4,7.46,1.1000000000000001,null,55500,"Call 1984; Call et al. 1984",null,{"$f":"EXP(LN(H10)-0.597*(LN(F10)-LN('Summary Sheet'!$C$6))-8.802*(E10-'Summary Sheet'!$C$4)-2.089*(LN(D10)-LN('Summary Sheet'!$C$5))+0.491*(E10^2-'Summary Sheet'!$C$4^2)+0.23*((E10*LN(D10)-'Summary Sheet'!$C$4*LN('Summary Sheet'!$C$5))))","v":87232.10441190195},null,null,{"$f":"GEOMEAN(K7:K8,K10)","v":70846.905401769967},{"$f":"N10","v":70846.905401769967},null,"Physa","Mollusk","Value is from 2007 FW Cu AWQC Appendix C recommendation","Raw Lake Superior water"]
[]
[null,"Snail, Melanoides tuberculata","R, M, T",18.72,6.68,3.2,null,68230,"Shuhaimi-Othman et al. 2012b, 2013",null,{"$f":"EXP(LN(H12)-0.597*(LN(F12)-LN('Summary Sheet'!$C$6))-8.802*(E12-'Summary Sheet'!$C$4)-2.089*(LN(D12)-LN('Summary Sheet'!$C$5))+0.491*(E12^2-'Summary Sheet'!$C$4^2)+0.23*((E12*LN(D12)-'Summary Sheet'!$C$4*LN('Summary Sheet'!$C$5))))","v":202135.99697737375},null,null,{"$f":"GEOMEAN(K12)","v":202135.99697737375},{"$f":"N12","v":202135.99697737375},null,"Melanoides","Mollusk","Value is from Shuhaimi-Othman et al. 2013","Tap water (Malaysia)"]
[]
[null,"Fatmucket, Lampsilis siliquoidea","R, M, T",107,8.19,0.5,">",54300,"Ivey et al. 2014",">",{"$f":"EXP(LN(H14)-0.597*(LN(F14)-LN('Summary Sheet'!$C$6))-8.802*(E14-'Summary Sheet'!$C$4)-2.089*(LN(D14)-LN('Summary Sheet'!$C$5))+0.491*(E14^2-'Summary Sheet'!$C$4^2)+0.23*((E14*LN(D14)-'Summary Sheet'!$C$4*LN('Summary Sheet'!$C$5))))","v":97719.217558108416},"f",null,"-",null,null,"Lampsilis",null,"Author reported","Well water/deionized water mix"]
[null,"Fatmucket, Lampsilis siliquoidea","F, M, T",106,6.12,0.48,">",6302,"Wang et al. 2016, 2018",">",{"$f":"EXP(LN(H15)-0.597*(LN(F15)-LN('Summary Sheet'!$C$6))-8.802*(E15-'Summary Sheet'!$C$4)-2.089*(LN(D15)-LN('Summary Sheet'!$C$5))+0.491*(E15^2-'Summary Sheet'!$C$4^2)+0.23*((E15*LN(D15)-'Summary Sheet'!$C$4*LN('Summary Sheet'!$C$5))))","v":49916.991084267444},null,">",{"$f":"GEOMEAN(K15)","v":49916.991084267444},{"$f":"N15","v":49916.991084267444},">","Lampsilis","Mollusk","Author reported","Well water/deionized water mix"]
[]
[null,"Cladoceran, Ceriodaphnia dubia","S, M, A",50,7.42,1.1000000000000001,null,1900,"McCauley et al. 1986",null,{"$f":"EXP(LN(H17)-0.597*(LN(F17)-LN('Summary Sheet'!$C$6))-8.802*(E17-'Summary Sheet'!$C$4)-2.089*(LN(D17)-LN('Summary Sheet'!$C$5))+0.491*(E17^2-'Summary Sheet'!$C$4^2)+0.23*((E17*LN(D17)-'Summary Sheet'!$C$4*LN('Summary Sheet'!$C$5))))","v":2998.0447221993131},null,null,"-",null,null,"Ceriodaphnia",null,"Value is from 2007 FW Cu AWQC Appendix C recommendation","Raw Lake Superior water"]
[null,"Cladoceran, Ceriodaphnia dubia","S, M, A",50.5,7.86,1.1000000000000001,null,1500,"McCauley et al. 1986",null,{"$f":"EXP(LN(H18)-0.597*(LN(F18)-LN('Summary Sheet'!$C$6))-8.802*(E18-'Summary Sheet'!$C$4)-2.089*(LN(D18)-LN('Summary Sheet'!$C$5))+0.491*(E18^2-'Summary Sheet'!$C$4^2)+0.23*((E18*LN(D18)-'Summary Sheet'!$C$4*LN('Summary Sheet'!$C$5))))","v":1979.5735326624472},null,null,"-",null,null,"Ceriodaphnia",null,"Value is from 2007 FW Cu AWQC Appendix C recommendation","UW-S Lake Superior lab water"]
[null,"Cladoceran, Ceriodaphnia dubia","S, M, A",50,8.1300000000000008,1.1000000000000001,null,2560,"McCauley et al. 1986",null,{"$f":"EXP(LN(H19)-0.597*(LN(F19)-LN('Summary Sheet'!$C$6))-8.802*(E19-'Summary Sheet'!$C$4)-2.089*(LN(D19)-LN('Summary Sheet'!$C$5))+0.491*(E19^2-'Summary Sheet'!$C$4^2)+0.23*((E19*LN(D19)-'Summary Sheet'!$C$4*LN('Summary Sheet'!$C$5))))","v":3341.4757342832477},null,null,"-",null,null,"Ceriodaphnia",null,"Value is from 2007 FW Cu AWQC Appendix C recommendation","Raw Lake Superior water"]
[null,"Cladoceran, Ceriodaphnia dubia","R, M, T",25,7.5,0.5,null,720,"ENSR 1992d",null,{"$f":"EXP(LN(H20)-0.597*(LN(F20)-LN('Summary Sheet'!$C$6))-8.802*(E20-'Summary Sheet'!$C$4)-2.089*(LN(D20)-LN('Summary Sheet'!$C$5))+0.491*(E20^2-'Summary Sheet'!$C$4^2)+0.23*((E20*LN(D20)-'Summary Sheet'!$C$4*LN('Summary Sheet'!$C$5))))","v":2235.569051723935},null,null,"-",null,null,"Ceriodaphnia",null,"Value is from 2007 FW Cu AWQC Appendix C recommendation","Very Soft Lab Recon water"]
[null,"Cladoceran, Ceriodaphnia dubia","R, M, T",49,7.65,0.5,null,1880,"ENSR 1992d",null,{"$f":"EXP(LN(H21)-0.597*(LN(F21)-LN('Summary Sheet'!$C$6))-8.802*(E21-'Summary Sheet'!$C$4)-2.089*(LN(D21)-LN('Summary Sheet'!$C$5))+0.491*(E21^2-'Summary Sheet'!$C$4^2)+0.23*((E21*LN(D21)-'Summary Sheet'!$C$4*LN('Summary Sheet'!$C$5))))","v":4259.216234186234},null,null,"-",null,null,"Ceriodaphnia",null,"Value is from 2007 FW Cu AWQC Appendix C recommendation","Soft Lab Recon water"]
[null,"Cladoceran, Ceriodaphnia dubia","S, M, T",95,7.9,0.5,null,2450,"ENSR 1992d",null,{"$f":"EXP(LN(H22)-0.597*(LN(F22)-LN('Summary Sheet'!$C$6))-8.802*(E22-'Summary Sheet'!$C$4)-2.089*(LN(D22)-LN('Summary Sheet'!$C$5))+0.491*(E22^2-'Summary Sheet'!$C$4^2)+0.23*((E22*LN(D22)-'Summary Sheet'!$C$4*LN('Summary Sheet'!$C$5))))","v":4331.2846425147472},null,null,"-",null,null,"Ceriodaphnia",null,"Value is from 2007 FW Cu AWQC Appendix C recommendation","Mod Hard Lab Recon water"]
[null,"Cladoceran, Ceriodaphnia dubia","R, M, T",193,8.0500000000000007,0.5,">",99600,"ENSR 1992d",">",{"$f":"EXP(LN(H23)-0.597*(LN(F23)-LN('Summary Sheet'!$C$6))-8.802*(E23-'Summary Sheet'!$C$4)-2.089*(LN(D23)-LN('Summary Sheet'!$C$5))+0.491*(E23^2-'Summary Sheet'!$C$4^2)+0.23*((E23*LN(D23)-'Summary Sheet'!$C$4*LN('Summary Sheet'!$C$5))))","v":150523.83095660387},null,null,"-",null,null,"Ceriodaphnia",null,"Value is from 2007 FW Cu AWQC Appendix C recommendation","Hard Lab Recon water"]
[null,"Cladoceran, Ceriodaphnia dubia","S, U, NR",90,7.15,0.5,null,3727,"Fort and Stover 1995",null,{"$f":"EXP(LN(H24)-0.597*(LN(F24)-LN('Summary Sheet'!$C$6))-8.802*(E24-'Summary Sheet'!$C$4)-2.089*(LN(D24)-LN('Summary Sheet'!$C$5))+0.491*(E24^2-'Summary Sheet'!$C$4^2)+0.23*((E24*LN(D24)-'Summary Sheet'!$C$4*LN('Summary Sheet'!$C$5))))","v":8874.7165266296997},null,null,"-",null,null,"Ceriodaphnia",null,"Value is from 2007 FW Cu AWQC Appendix C recommendation","Mod Hard Lab Recon water"]
[null,"Cladoceran, Ceriodaphnia dubia","S, U, NR",90,7.15,0.5,null,5673,"Fort and Stover 1995",null,{"$f":"EXP(LN(H25)-0.597*(LN(F25)-LN('Summary Sheet'!$C$6))-8.802*(E25-'Summary Sheet'!$C$4)-2.089*(LN(D25)-LN('Summary Sheet'!$C$5))+0.491*(E25^2-'Summary Sheet'!$C$4^2)+0.23*((E25*LN(D25)-'Summary Sheet'!$C$4*LN('Summary Sheet'!$C$5))))","v":13508.523438575332},null,null,"-",null,null,"Ceriodaphnia",null,"Value is from 2007 FW Cu AWQC Appendix C recommendation","Mod Hard Lab Recon water"]
[null,"Cladoceran, Ceriodaphnia dubia","S, U, NR",89,8.1999999999999993,0.5,null,2880,"Soucek et al. 2001",null,{"$f":"EXP(LN(H26)-0.597*(LN(F26)-LN('Summary Sheet'!$C$6))-8.802*(E26-'Summary Sheet'!$C$4)-2.089*(LN(D26)-LN('Summary Sheet'!$C$5))+0.491*(E26^2-'Summary Sheet'!$C$4^2)+0.23*((E26*LN(D26)-'Summary Sheet'!$C$4*LN('Summary Sheet'!$C$5))))","v":5397.6182056808257},null,null,"-",null,null,"Ceriodaphnia",null,"Value is from 2007 FW Cu AWQC Appendix C recommendation","Mod Hard Lab Recon water"]
[null,"Cladoceran, Ceriodaphnia dubia","R, U, T",142,8.1999999999999993,1.6,null,153440,"Griffitt et al. 2008",null,{"$f":"EXP(LN(H27)-0.597*(LN(F27)-LN('Summary Sheet'!$C$6))-8.802*(E27-'Summary Sheet'!$C$4)-2.089*(LN(D27)-LN('Summary Sheet'!$C$5))+0.491*(E27^2-'Summary Sheet'!$C$4^2)+0.23*((E27*LN(D27)-'Summary Sheet'!$C$4*LN('Summary Sheet'!$C$5))))","v":130612.6871394336},null,null,null,null,null,"Ceriodaphnia",null,"Value is from 2007 FW Cu AWQC Appendix C recommendation","Tap water (Gainesville, FL)"]
[null,"Cladoceran, Ceriodaphnia dubia","S, U, T",10.6,6.01,0.5,null,71.12,"European Al Association 2009",null,{"$f":"EXP(LN(H28)-0.597*(LN(F28)-LN('Summary Sheet'!$C$6))-8.802*(E28-'Summary Sheet'!$C$4)-2.089*(LN(D28)-LN('Summary Sheet'!$C$5))+0.491*(E28^2-'Summary Sheet'!$C$4^2)+0.23*((E28*LN(D28)-'Summary Sheet'!$C$4*LN('Summary Sheet'!$C$5))))","v":3400.9933876562427},null,null,"-",null,null,"Ceriodaphnia",null,"Value is from 2007 FW Cu AWQC Appendix C recommendation","Very Soft Lab Recon water"]
[null,"Cladoceran, Ceriodaphnia dubia","S, U, T",10.6,6.05,2,null,686.5,"European Al Association 2009",null,{"$f":"EXP(LN(H29)-0.597*(LN(F29)-LN('Summary Sheet'!$C$6))-8.802*(E29-'Summary Sheet'!$C$4)-2.089*(LN(D29)-LN('Summary Sheet'!$C$5))+0.491*(E29^2-'Summary Sheet'!$C$4^2)+0.23*((E29*LN(D29)-'Summary Sheet'!$C$4*LN('Summary Sheet'!$C$5))))","v":13068.251238286202},null,null,"-",null,null,"Ceriodaphnia",null,"Author reported","Very Soft Lab Recon water"]
[null,"Cladoceran, Ceriodaphnia dubia","S, U, T",10.6,6.09,4,null,1558.1,"European Al Association 2009",null,{"$f":"EXP(LN(H30)-0.597*(LN(F30)-LN('Summary Sheet'!$C$6))-8.802*(E30-'Summary Sheet'!$C$4)-2.089*(LN(D30)-LN('Summary Sheet'!$C$5))+0.491*(E30^2-'Summary Sheet'!$C$4^2)+0.23*((E30*LN(D30)-'Summary Sheet'!$C$4*LN('Summary Sheet'!$C$5))))","v":17886.790741788296},null,null,"-",null,null,"Ceriodaphnia",null,"Author reported","Very Soft Lab Recon water"]
[null,"Cladoceran, Ceriodaphnia dubia","S, U, T",10.6,6.01,0.5,null,68.099999999999994,"European Al Association 2009",null,{"$f":"EXP(LN(H31)-0.597*(LN(F31)-LN('Summary Sheet'!$C$6))-8.802*(E31-'Summary Sheet'!$C$4)-2.089*(LN(D31)-LN('Summary Sheet'!$C$5))+0.491*(E31^2-'Summary Sheet'!$C$4^2)+0.23*((E31*LN(D31)-'Summary Sheet'!$C$4*LN('Summary Sheet'!$C$5))))","v":3256.5755019599214},null,null,"-",null,null,"Ceriodaphnia",null,"Value is from 2007 FW Cu AWQC Appendix C recommendation","Very Soft Lab Recon water"]
[null,"Cladoceran, Ceriodaphnia dubia","S, U, T",10.6,6.03,0.5,null,163,"European Al Association 2009",null,{"$f":"EXP(LN(H32)-0.597*(LN(F32)-LN('Summary Sheet'!$C$6))-8.802*(E32-'Summary Sheet'!$C$4)-2.089*(LN(D32)-LN('Summary Sheet'!$C$5))+0.491*(E32^2-'Summary Sheet'!$C$4^2)+0.23*((E32*LN(D32)-'Summary Sheet'!$C$4*LN('Summary Sheet'!$C$5))))","v":7437.2555253793444},null,null,"-",null,null,"Ceriodaphnia",null,"Value is from 2007 FW Cu AWQC Appendix C recommendation","Very Soft Lab Recon water"]
[null,"Cladoceran, Ceriodaphnia dubia","S, U, T",10.6,5.97,0.5,null,178.5,"European Al Association 2009",null,{"$f":"EXP(LN(H33)-0.597*(LN(F33)-LN('Summary Sheet'!$C$6))-8.802*(E33-'Summary Sheet'!$C$4)-2.089*(LN(D33)-LN('Summary Sheet'!$C$5))+0.491*(E33^2-'Summary Sheet'!$C$4^2)+0.23*((E33*LN(D33)-'Summary Sheet'!$C$4*LN('Summary Sheet'!$C$5))))","v":9387.3263131573076},null,null,"-",null,null,"Ceriodaphnia",null,"Value is from 2007 FW Cu AWQC Appendix C recommendation","Very Soft Lab Recon water"]
[null,"Cladoceran, Ceriodaphnia dubia","S, U, T",10.6,5.92,0.5,null,141,"European Al Association 2009",null,{"$f":"EXP(LN(H34)-0.597*(LN(F34)-LN('Summary Sheet'!$C$6))-8.802*(E34-'Summary Sheet'!$C$4)-2.089*(LN(D34)-LN('Summary Sheet'!$C$5))+0.491*(E34^2-'Summary Sheet'!$C$4^2)+0.23*((E34*LN(D34)-'Summary Sheet'!$C$4*LN('Summary Sheet'!$C$5))))","v":8369.4023919185929},null,null,"-",null,null,"Ceriodaphnia",null,"Value is from 2007 FW Cu AWQC Appendix C recommendation","Very Soft Lab Recon water"]
[null,"Cladoceran, Ceriodaphnia dubia","S, U, T",10.6,6.99,0.5,">",1300,"European Al Association 2009",">",{"$f":"EXP(LN(H35)-0.597*(LN(F35)-LN('Summary Sheet'!$C$6))-8.802*(E35-'Summary Sheet'!$C$4)-2.089*(LN(D35)-LN('Summary Sheet'!$C$5))+0.491*(E35^2-'Summary Sheet'!$C$4^2)+0.23*((E35*LN(D35)-'Summary Sheet'!$C$4*LN('Summary Sheet'!$C$5))))","v":9888.1295847568108},null,null,"-",null,null,"Ceriodaphnia",null,"Value is from 2007 FW Cu AWQC Appendix C recommendation","Very Soft Lab Recon water"]
[null,"Cladoceran, Ceriodaphnia dubia","S, U, T",10.6,7.85,0.5,">",5000,"European Al Association 2009",">",{"$f":"EXP(LN(H36)-0.597*(LN(F36)-LN('Summary Sheet'!$C$6))-8.802*(E36-'Summary Sheet'!$C$4)-2.089*(LN(D36)-LN('Summary Sheet'!$C$5))+0.491*(E36^2-'Summary Sheet'!$C$4^2)+0.23*((E36*LN(D36)-'Summary Sheet'!$C$4*LN('Summary Sheet'!$C$5))))","v":16477.634478814638},null,null,"-",null,null,"Ceriodaphnia",null,"Value is from 2007 FW Cu AWQC Appendix C recommendation","Very Soft Lab Recon water"]
[null,"Cladoceran, Ceriodaphnia dubia","S, U, T",10.6,6.8,2,">",10000,"European Al Association 2009",">",{"$f":"EXP(LN(H37)-0.597*(LN(F37)-LN('Summary Sheet'!$C$6))-8.802*(E37-'Summary Sheet'!$C$4)-2.089*(LN(D37)-LN('Summary Sheet'!$C$5))+0.491*(E37^2-'Summary Sheet'!$C$4^2)+0.23*((E37*LN(D37)-'Summary Sheet'!$C$4*LN('Summary Sheet'!$C$5))))","v":44109.698591059881},null,null,"-",null,null,"Ceriodaphnia",null,"Author reported","Very Soft Lab Recon water"]
[null,"Cladoceran, Ceriodaphnia dubia","S, U, T",10.6,7.82,2,">",15000,"European Al Association 2009",">",{"$f":"EXP(LN(H38)-0.597*(LN(F38)-LN('Summary Sheet'!$C$6))-8.802*(E38-'Summary Sheet'!$C$4)-2.089*(LN(D38)-LN('Summary Sheet'!$C$5))+0.491*(E38^2-'Summary Sheet'!$C$4^2)+0.23*((E38*LN(D38)-'Summary Sheet'!$C$4*LN('Summary Sheet'!$C$5))))","v":21975.968990800226},null,null,"-",null,null,"Ceriodaphnia",null,"Author reported","Very Soft Lab Recon water"]
[null,"Cladoceran, Ceriodaphnia dubia","S, U, T",10.6,6.77,4,">",10000,"European Al Association 2009",">",{"$f":"EXP(LN(H39)-0.597*(LN(F39)-LN('Summary Sheet'!$C$6))-8.802*(E39-'Summary Sheet'!$C$4)-2.089*(LN(D39)-LN('Summary Sheet'!$C$5))+0.491*(E39^2-'Summary Sheet'!$C$4^2)+0.23*((E39*LN(D39)-'Summary Sheet'!$C$4*LN('Summary Sheet'!$C$5))))","v":30592.498185663844},null,null,"-",null,null,"Ceriodaphnia",null,"Author reported","Very Soft Lab Recon water"]
[null,"Cladoceran, Ceriodaphnia dubia","S, U, T",10.6,7.66,4,">",15000,"European Al Association 2009",">",{"$f":"EXP(LN(H40)-0.597*(LN(F40)-LN('Summary Sheet'!$C$6))-8.802*(E40-'Summary Sheet'!$C$4)-2.089*(LN(D40)-LN('Summary Sheet'!$C$5))+0.491*(E40^2-'Summary Sheet'!$C$4^2)+0.23*((E40*LN(D40)-'Summary Sheet'!$C$4*LN('Summary Sheet'!$C$5))))","v":16142.772781331214},null,null,"-",null,null,"Ceriodaphnia",null,"Author reported","Very Soft Lab Recon water"]
[null,"Cladoceran, Ceriodaphnia dubia","S, U, T",10.6,7.9,0.5,">",2000,"European Al Association 2009",">",{"$f":"EXP(LN(H41)-0.597*(LN(F41)-LN('Summary Sheet'!$C$6))-8.802*(E41-'Summary Sheet'!$C$4)-2.089*(LN(D41)-LN('Summary Sheet'!$C$5))+0.491*(E41^2-'Summary Sheet'!$C$4^2)+0.23*((E41*LN(D41)-'Summary Sheet'!$C$4*LN('Summary Sheet'!$C$5))))","v":6420.0478080470939},null,null,"-",null,null,"Ceriodaphnia",null,"Value is from 2007 FW Cu AWQC Appendix C recommendation","Very Soft Lab Recon water"]
[null,"Cladoceran, Ceriodaphnia dubia","S, U, T",10.6,7.89,0.5,">",2000,"European Al Association 2009",">",{"$f":"EXP(LN(H42)-0.597*(LN(F42)-LN('Summary Sheet'!$C$6))-8.802*(E42-'Summary Sheet'!$C$4)-2.089*(LN(D42)-LN('Summary Sheet'!$C$5))+0.491*(E42^2-'Summary Sheet'!$C$4^2)+0.23*((E42*LN(D42)-'Summary Sheet'!$C$4*LN('Summary Sheet'!$C$5))))","v":6452.6229057917708},null,null,"-",null,null,"Ceriodaphnia",null,"Value is from 2007 FW Cu AWQC Appendix C recommendation","Very Soft Lab Recon water"]
[null,"Cladoceran, Ceriodaphnia dubia","S, U, T",60,6.04,0.5,null,110.8,"European Al Association 2009",null,{"$f":"EXP(LN(H43)-0.597*(LN(F43)-LN('Summary Sheet'!$C$6))-8.802*(E43-'Summary Sheet'!$C$4)-2.089*(LN(D43)-LN('Summary Sheet'!$C$5))+0.491*(E43^2-'Summary Sheet'!$C$4^2)+0.23*((E43*LN(D43)-'Summary Sheet'!$C$4*LN('Summary Sheet'!$C$5))))","v":1468.2268420951796},null,null,"-",null,null,"Ceriodaphnia",null,"Value is from 2007 FW Cu AWQC Appendix C recommendation","Soft Lab Recon water"]
[null,"Cladoceran, Ceriodaphnia dubia","S, U, T",60,5.98,2,null,1137.0999999999999,"European Al Association 2009",null,{"$f":"EXP(LN(H44)-0.597*(LN(F44)-LN('Summary Sheet'!$C$6))-8.802*(E44-'Summary Sheet'!$C$4)-2.089*(LN(D44)-LN('Summary Sheet'!$C$5))+0.491*(E44^2-'Summary Sheet'!$C$4^2)+0.23*((E44*LN(D44)-'Summary Sheet'!$C$4*LN('Summary Sheet'!$C$5))))","v":7407.2275582513357},null,null,"-",null,null,"Ceriodaphnia",null,"Author reported","Soft Lab Recon water"]
[null,"Cladoceran, Ceriodaphnia dubia","S, U, T",60,5.73,4,null,8046.7,"European Al Association 2009",null,{"$f":"EXP(LN(H45)-0.597*(LN(F45)-LN('Summary Sheet'!$C$6))-8.802*(E45-'Summary Sheet'!$C$4)-2.089*(LN(D45)-LN('Summary Sheet'!$C$5))+0.491*(E45^2-'Summary Sheet'!$C$4^2)+0.23*((E45*LN(D45)-'Summary Sheet'!$C$4*LN('Summary Sheet'!$C$5))))","v":58738.826596021019},null,null,"-",null,null,"Ceriodaphnia",null,"Author reported","Soft Lab Recon water"]
[null,"Cladoceran, Ceriodaphnia dubia","S, U, T",60,6.71,0.5,">",10000,"European Al Association 2009",">",{"$f":"EXP(LN(H46)-0.597*(LN(F46)-LN('Summary Sheet'!$C$6))-8.802*(E46-'Summary Sheet'!$C$4)-2.089*(LN(D46)-LN('Summary Sheet'!$C$5))+0.491*(E46^2-'Summary Sheet'!$C$4^2)+0.23*((E46*LN(D46)-'Summary Sheet'!$C$4*LN('Summary Sheet'!$C$5))))","v":45360.198592164648},null,null,"-",null,null,"Ceriodaphnia",null,"Value is from 2007 FW Cu AWQC Appendix C recommendation","Soft Lab Recon water"]
[null,"Cladoceran, Ceriodaphnia dubia","S, U, T",60,7.83,0.5,">",5000,"European Al Association 2009",">",{"$f":"EXP(LN(H47)-0.597*(LN(F47)-LN('Summary Sheet'!$C$6))-8.802*(E47-'Summary Sheet'!$C$4)-2.089*(LN(D47)-LN('Summary Sheet'!$C$5))+0.491*(E47^2-'Summary Sheet'!$C$4^2)+0.23*((E47*LN(D47)-'Summary Sheet'!$C$4*LN('Summary Sheet'!$C$5))))","v":10112.657087054828},null,null,"-",null,null,"Ceriodaphnia",null,"Value is from 2007 FW Cu AWQC Appendix C recommendation","Soft Lab Recon water"]
[null,"Cladoceran, Ceriodaphnia dubia","S, U, T",60,6.79,2,">",10000,"European Al Association 2009",">",{"$f":"EXP(LN(H48)-0.597*(LN(F48)-LN('Summary Sheet'!$C$6))-8.802*(E48-'Summary Sheet'!$C$4)-2.089*(LN(D48)-LN('Summary Sheet'!$C$5))+0.491*(E48^2-'Summary Sheet'!$C$4^2)+0.23*((E48*LN(D48)-'Summary Sheet'!$C$4*LN('Summary Sheet'!$C$5))))","v":17965.85916675513},null,null,"-",null,null,"Ceriodaphnia",null,"Author reported","Soft Lab Recon water"]
[null,"Cladoceran, Ceriodaphnia dubia","S, U, T",60,7.67,2,">",15000,"European Al Association 2009",">",{"$f":"EXP(LN(H49)-0.597*(LN(F49)-LN('Summary Sheet'!$C$6))-8.802*(E49-'Summary Sheet'!$C$4)-2.089*(LN(D49)-LN('Summary Sheet'!$C$5))+0.491*(E49^2-'Summary Sheet'!$C$4^2)+0.23*((E49*LN(D49)-'Summary Sheet'!$C$4*LN('Summary Sheet'!$C$5))))","v":13801.13025578282},null,null,"-",null,null,"Ceriodaphnia",null,"Author reported","Soft Lab Recon water"]
[null,"Cladoceran, Ceriodaphnia dubia","S, U, T",60,6.68,4,">",15000,"European Al Association 2009",">",{"$f":"EXP(LN(H50)-0.597*(LN(F50)-LN('Summary Sheet'!$C$6))-8.802*(E50-'Summary Sheet'!$C$4)-2.089*(LN(D50)-LN('Summary Sheet'!$C$5))+0.491*(E50^2-'Summary Sheet'!$C$4^2)+0.23*((E50*LN(D50)-'Summary Sheet'!$C$4*LN('Summary Sheet'!$C$5))))","v":20434.97447207824},null,null,"-",null,null,"Ceriodaphnia",null,"Author reported","Soft Lab Recon water"]
[null,"Cladoceran, Ceriodaphnia dubia","S, U, T",60,7.62,4,">",15000,"European Al Association 2009",">",{"$f":"EXP(LN(H51)-0.597*(LN(F51)-LN('Summary Sheet'!$C$6))-8.802*(E51-'Summary Sheet'!$C$4)-2.089*(LN(D51)-LN('Summary Sheet'!$C$5))+0.491*(E51^2-'Summary Sheet'!$C$4^2)+0.23*((E51*LN(D51)-'Summary Sheet'!$C$4*LN('Summary Sheet'!$C$5))))","v":9286.7361540282},null,null,"-",null,null,"Ceriodaphnia",null,"Author reported","Soft Lab Recon water"]
[null,"Cladoceran, Ceriodaphnia dubia","S, U, T",120,6.06,2,null,3386.8,"European Al Association 2009",null,{"$f":"EXP(LN(H52)-0.597*(LN(F52)-LN('Summary Sheet'!$C$6))-8.802*(E52-'Summary Sheet'!$C$4)-2.089*(LN(D52)-LN('Summary Sheet'!$C$5))+0.491*(E52^2-'Summary Sheet'!$C$4^2)+0.23*((E52*LN(D52)-'Summary Sheet'!$C$4*LN('Summary Sheet'!$C$5))))","v":11659.156089624066},null,null,"-",null,null,"Ceriodaphnia",null,"Author reported","Mod Hard Lab Recon water"]
[null,"Cladoceran, Ceriodaphnia dubia","S, U, T",120,5.6,4,null,10484.200000000001,"European Al Association 2009",null,{"$f":"EXP(LN(H53)-0.597*(LN(F53)-LN('Summary Sheet'!$C$6))-8.802*(E53-'Summary Sheet'!$C$4)-2.089*(LN(D53)-LN('Summary Sheet'!$C$5))+0.491*(E53^2-'Summary Sheet'!$C$4^2)+0.23*((E53*LN(D53)-'Summary Sheet'!$C$4*LN('Summary Sheet'!$C$5))))","v":59213.084994023775},null,null,"-",null,null,"Ceriodaphnia",null,"Author reported","Mod Hard Lab Recon water"]
[null,"Cladoceran, Ceriodaphnia dubia","S, U, T",120,6.93,0.5,">",5000,"European Al Association 2009",">",{"$f":"EXP(LN(H54)-0.597*(LN(F54)-LN('Summary Sheet'!$C$6))-8.802*(E54-'Summary Sheet'!$C$4)-2.089*(LN(D54)-LN('Summary Sheet'!$C$5))+0.491*(E54^2-'Summary Sheet'!$C$4^2)+0.23*((E54*LN(D54)-'Summary Sheet'!$C$4*LN('Summary Sheet'!$C$5))))","v":12458.926111130249},null,null,"-",null,null,"Ceriodaphnia",null,"Value is from 2007 FW Cu AWQC Appendix C recommendation","Mod Hard Lab Recon water"]
[null,"Cladoceran, Ceriodaphnia dubia","S, U, T",120,7.88,0.5,">",5000,"European Al Association 2009",">",{"$f":"EXP(LN(H55)-0.597*(LN(F55)-LN('Summary Sheet'!$C$6))-8.802*(E55-'Summary Sheet'!$C$4)-2.089*(LN(D55)-LN('Summary Sheet'!$C$5))+0.491*(E55^2-'Summary Sheet'!$C$4^2)+0.23*((E55*LN(D55)-'Summary Sheet'!$C$4*LN('Summary Sheet'!$C$5))))","v":8287.3376745196292},null,null,"-",null,null,"Ceriodaphnia",null,"Value is from 2007 FW Cu AWQC Appendix C recommendation","Mod Hard Lab Recon water"]
[null,"Cladoceran, Ceriodaphnia dubia","S, U, T",120,6.76,2,">",15000,"European Al Association 2009",">",{"$f":"EXP(LN(H56)-0.597*(LN(F56)-LN('Summary Sheet'!$C$6))-8.802*(E56-'Summary Sheet'!$C$4)-2.089*(LN(D56)-LN('Summary Sheet'!$C$5))+0.491*(E56^2-'Summary Sheet'!$C$4^2)+0.23*((E56*LN(D56)-'Summary Sheet'!$C$4*LN('Summary Sheet'!$C$5))))","v":19295.591510498769},null,null,"-",null,null,"Ceriodaphnia",null,"Author reported","Mod Hard Lab Recon water"]
[null,"Cladoceran, Ceriodaphnia dubia","S, U, T",120,7.71,2,">",15000,"European Al Association 2009",">",{"$f":"EXP(LN(H57)-0.597*(LN(F57)-LN('Summary Sheet'!$C$6))-8.802*(E57-'Summary Sheet'!$C$4)-2.089*(LN(D57)-LN('Summary Sheet'!$C$5))+0.491*(E57^2-'Summary Sheet'!$C$4^2)+0.23*((E57*LN(D57)-'Summary Sheet'!$C$4*LN('Summary Sheet'!$C$5))))","v":10952.580564323793},null,null,"-",null,null,"Ceriodaphnia",null,"Author reported","Mod Hard Lab Recon water"]
[null,"Cladoceran, Ceriodaphnia dubia","S, U, T",120,6.6,4,">",15000,"European Al Association 2009",">",{"$f":"EXP(LN(H58)-0.597*(LN(F58)-LN('Summary Sheet'!$C$6))-8.802*(E58-'Summary Sheet'!$C$4)-2.089*(LN(D58)-LN('Summary Sheet'!$C$5))+0.491*(E58^2-'Summary Sheet'!$C$4^2)+0.23*((E58*LN(D58)-'Summary Sheet'!$C$4*LN('Summary Sheet'!$C$5))))","v":15312.147807982396},null,null,"-",null,null,"Ceriodaphnia",null,"Author reported","Mod Hard Lab Recon water"]
[null,"Cladoceran, Ceriodaphnia dubia","S, U, T",120,7.6,4,">",15000,"European Al Association 2009",">",{"$f":"EXP(LN(H59)-0.597*(LN(F59)-LN('Summary Sheet'!$C$6))-8.802*(E59-'Summary Sheet'!$C$4)-2.089*(LN(D59)-LN('Summary Sheet'!$C$5))+0.491*(E59^2-'Summary Sheet'!$C$4^2)+0.23*((E59*LN(D59)-'Summary Sheet'!$C$4*LN('Summary Sheet'!$C$5))))","v":7388.8313906980875},null,null,"-",null,null,"Ceriodaphnia",null,"Author reported","Mod Hard Lab Recon water"]
[null,"Cladoceran, Ceriodaphnia dubia","S, M, T",10.6,6.03,0.5,null,119.71,"European Al Association 2010",null,{"$f":"EXP(LN(H60)-0.597*(LN(F60)-LN('Summary Sheet'!$C$6))-8.802*(E60-'Summary Sheet'!$C$4)-2.089*(LN(D60)-LN('Summary Sheet'!$C$5))+0.491*(E60^2-'Summary Sheet'!$C$4^2)+0.23*((E60*LN(D60)-'Summary Sheet'!$C$4*LN('Summary Sheet'!$C$5))))","v":5462.0482143752197},null,null,"-",null,null,"Ceriodaphnia",null,"Value is from 2007 FW Cu AWQC Appendix C recommendation","Very Soft Lab Recon water"]
[null,"Cladoceran, Ceriodaphnia dubia","S, M, T",10.6,6.03,0.5,null,274.77999999999997,"European Al Association 2010",null,{"$f":"EXP(LN(H61)-0.597*(LN(F61)-LN('Summary Sheet'!$C$6))-8.802*(E61-'Summary Sheet'!$C$4)-2.089*(LN(D61)-LN('Summary Sheet'!$C$5))+0.491*(E61^2-'Summary Sheet'!$C$4^2)+0.23*((E61*LN(D61)-'Summary Sheet'!$C$4*LN('Summary Sheet'!$C$5))))","v":12537.478977078099},null,null,"-",null,null,"Ceriodaphnia",null,"Value is from 2007 FW Cu AWQC Appendix C recommendation","Very Soft Lab Recon water"]
[null,"Cladoceran, Ceriodaphnia dubia","S, M, T",10.6,6.03,0.5,null,119.98,"European Al Association 2010",null,{"$f":"EXP(LN(H62)-0.597*(LN(F62)-LN('Summary Sheet'!$C$6))-8.802*(E62-'Summary Sheet'!$C$4)-2.089*(LN(D62)-LN('Summary Sheet'!$C$5))+0.491*(E62^2-'Summary Sheet'!$C$4^2)+0.23*((E62*LN(D62)-'Summary Sheet'!$C$4*LN('Summary Sheet'!$C$5))))","v":5474.3675946933354},null,null,"-",null,null,"Ceriodaphnia",null,"Value is from 2007 FW Cu AWQC Appendix C recommendation","Very Soft Lab Recon water"]
[null,"Cladoceran, Ceriodaphnia dubia","S, M, T",10.6,6.07,0.5,null,92.495000000000005,"European Al Association 2010",null,{"$f":"EXP(LN(H63)-0.597*(LN(F63)-LN('Summary Sheet'!$C$6))-8.802*(E63-'Summary Sheet'!$C$4)-2.089*(LN(D63)-LN('Summary Sheet'!$C$5))+0.491*(E63^2-'Summary Sheet'!$C$4^2)+0.23*((E63*LN(D63)-'Summary Sheet'!$C$4*LN('Summary Sheet'!$C$5))))","v":3846.6019370021277},null,null,"-",null,null,"Ceriodaphnia",null,"Value is from 2007 FW Cu AWQC Appendix C recommendation","Very Soft Lab Recon water"]
[null,"Cladoceran, Ceriodaphnia dubia","S, M, T",10.6,6.09,0.5,null,313.37,"European Al Association 2010",null,{"$f":"EXP(LN(H64)-0.597*(LN(F64)-LN('Summary Sheet'!$C$6))-8.802*(E64-'Summary Sheet'!$C$4)-2.089*(LN(D64)-LN('Summary Sheet'!$C$5))+0.491*(E64^2-'Summary Sheet'!$C$4^2)+0.23*((E64*LN(D64)-'Summary Sheet'!$C$4*LN('Summary Sheet'!$C$5))))","v":12449.136775790195},"g",null,"-",null,null,"Ceriodaphnia",null,"Value is from 2007 FW Cu AWQC Appendix C recommendation","Very Soft Lab Recon water"]
[null,"Cladoceran, Ceriodaphnia dubia","S, M, T",10.6,6.1,0.5,null,332.35,"European Al Association 2010",null,{"$f":"EXP(LN(H65)-0.597*(LN(F65)-LN('Summary Sheet'!$C$6))-8.802*(E65-'Summary Sheet'!$C$4)-2.089*(LN(D65)-LN('Summary Sheet'!$C$5))+0.491*(E65^2-'Summary Sheet'!$C$4^2)+0.23*((E65*LN(D65)-'Summary Sheet'!$C$4*LN('Summary Sheet'!$C$5))))","v":12906.33374546642},"g",null,"-",null,null,"Ceriodaphnia",null,"Value is from 2007 FW Cu AWQC Appendix C recommendation","Very Soft Lab Recon water"]
[null,"Cladoceran, Ceriodaphnia dubia","S, M, T",10.6,7.08,0.5,">",886.4,"European Al Association 2010",">",{"$f":"EXP(LN(H66)-0.597*(LN(F66)-LN('Summary Sheet'!$C$6))-8.802*(E66-'Summary Sheet'!$C$4)-2.089*(LN(D66)-LN('Summary Sheet'!$C$5))+0.491*(E66^2-'Summary Sheet'!$C$4^2)+0.23*((E66*LN(D66)-'Summary Sheet'!$C$4*LN('Summary Sheet'!$C$5))))","v":5970.4765972335854},null,null,"-",null,null,"Ceriodaphnia",null,"Value is from 2007 FW Cu AWQC Appendix C recommendation","Very Soft Lab Recon water"]
[null,"Cladoceran, Ceriodaphnia dubia","S, M, T",10.6,7.79,0.5,">",4278.3,"European Al Association 2010",">",{"$f":"EXP(LN(H67)-0.597*(LN(F67)-LN('Summary Sheet'!$C$6))-8.802*(E67-'Summary Sheet'!$C$4)-2.089*(LN(D67)-LN('Summary Sheet'!$C$5))+0.491*(E67^2-'Summary Sheet'!$C$4^2)+0.23*((E67*LN(D67)-'Summary Sheet'!$C$4*LN('Summary Sheet'!$C$5))))","v":14598.336911443223},null,null,"-",null,null,"Ceriodaphnia",null,"Value is from 2007 FW Cu AWQC Appendix C recommendation","Very Soft Lab Recon water"]
[null,"Cladoceran, Ceriodaphnia dubia","S, M, T",10.6,7.53,0.5,null,132.04,"European Al Association 2010",null,{"$f":"EXP(LN(H68)-0.597*(LN(F68)-LN('Summary Sheet'!$C$6))-8.802*(E68-'Summary Sheet'!$C$4)-2.089*(LN(D68)-LN('Summary Sheet'!$C$5))+0.491*(E68^2-'Summary Sheet'!$C$4^2)+0.23*((E68*LN(D68)-'Summary Sheet'!$C$4*LN('Summary Sheet'!$C$5))))","v":545.68752606712621},null,null,"-",null,null,"Ceriodaphnia",null,"Value is from 2007 FW Cu AWQC Appendix C recommendation","Very Soft Lab Recon water"]
[null,"Cladoceran, Ceriodaphnia dubia","S, M, T",60,6.01,0.5,null,463.26,"European Al Association 2010",null,{"$f":"EXP(LN(H69)-0.597*(LN(F69)-LN('Summary Sheet'!$C$6))-8.802*(E69-'Summary Sheet'!$C$4)-2.089*(LN(D69)-LN('Summary Sheet'!$C$5))+0.491*(E69^2-'Summary Sheet'!$C$4^2)+0.23*((E69*LN(D69)-'Summary Sheet'!$C$4*LN('Summary Sheet'!$C$5))))","v":6507.3326599169577},null,null,"-",null,null,"Ceriodaphnia",null,"Value is from 2007 FW Cu AWQC Appendix C recommendation","Soft Lab Recon water"]
[null,"Cladoceran, Ceriodaphnia dubia","S, M, T",60,5.99,0.5,">",859,"European Al Association 2010",">",{"$f":"EXP(LN(H70)-0.597*(LN(F70)-LN('Summary Sheet'!$C$6))-8.802*(E70-'Summary Sheet'!$C$4)-2.089*(LN(D70)-LN('Summary Sheet'!$C$5))+0.491*(E70^2-'Summary Sheet'!$C$4^2)+0.23*((E70*LN(D70)-'Summary Sheet'!$C$4*LN('Summary Sheet'!$C$5))))","v":12550.696073305704},null,null,{"$f":"GEOMEAN(K17:K63,K66:K70)","v":9923.1371294077126},null,null,"Ceriodaphnia",null,"Value is from 2007 FW Cu AWQC Appendix C recommendation","Soft Lab Recon water"]
[]
[null,"Cladoceran, Ceriodaphnia reticulata","S, U, T",45.1,7.25,1.1000000000000001,null,2800,"Shephard 1983",null,{"$f":"EXP(LN(H72)-0.597*(LN(F72)-LN('Summary Sheet'!$C$6))-8.802*(E72-'Summary Sheet'!$C$4)-2.089*(LN(D72)-LN('Summary Sheet'!$C$5))+0.491*(E72^2-'Summary Sheet'!$C$4^2)+0.23*((E72*LN(D72)-'Summary Sheet'!$C$4*LN('Summary Sheet'!$C$5))))","v":5196.9643604921312},"f",null,"-",null,null,"Ceriodaphnia",null,"Value is from personal communication with R. Erickson who works at the Lab","Lake Superior water (most likely raw)"]
[null,"Cladoceran, Ceriodaphnia reticulata","F, M, T",45.1,6,1.1000000000000001,null,304,"Shephard 1983",null,{"$f":"EXP(LN(H73)-0.597*(LN(F73)-LN('Summary Sheet'!$C$6))-8.802*(E73-'Summary Sheet'!$C$4)-2.089*(LN(D73)-LN('Summary Sheet'!$C$5))+0.491*(E73^2-'Summary Sheet'!$C$4^2)+0.23*((E73*LN(D73)-'Summary Sheet'!$C$4*LN('Summary Sheet'!$C$5))))","v":3330.0473984725768},null,null,"-",null,null,"Ceriodaphnia",null,"Value is from personal communication with R. Erickson who works at the Lab","Lake Superior water (most likely raw)"]
[null,"Cladoceran, Ceriodaphnia reticulata","F, M, T",4,5.5,1.1000000000000001,null,362,"Shephard 1983",null,{"$f":"EXP(LN(H74)-0.597*(LN(F74)-LN('Summary Sheet'!$C$6))-8.802*(E74-'Summary Sheet'!$C$4)-2.089*(LN(D74)-LN('Summary Sheet'!$C$5))+0.491*(E74^2-'Summary Sheet'!$C$4^2)+0.23*((E74*LN(D74)-'Summary Sheet'!$C$4*LN('Summary Sheet'!$C$5))))","v":91244.617762466005},null,null,{"$f":"GEOMEAN(K73:K74)","v":17431.262203424187},{"$f":"GEOMEAN(N17:N74)","v":13151.91260552015},null,"Ceriodaphnia","Invert","Value is from personal communication with R. Erickson who works at the Lab","Lake Superior water/deionized water mix"]
[]
[null,"Cladoceran, Daphnia magna","S, U, NR",48.5,7.8,1.1000000000000001,null,3900,"Biesinger and Christensen 1972",null,{"$f":"EXP(LN(H76)-0.597*(LN(F76)-LN('Summary Sheet'!$C$6))-8.802*(E76-'Summary Sheet'!$C$4)-2.089*(LN(D76)-LN('Summary Sheet'!$C$5))+0.491*(E76^2-'Summary Sheet'!$C$4^2)+0.23*((E76*LN(D76)-'Summary Sheet'!$C$4*LN('Summary Sheet'!$C$5))))","v":5274.9376572391247},null,null,"-",null,null,"Daphnia",null,"Value is from 2007 FW Cu AWQC Appendix C recommendation","Lake Superior water (most likely raw)"]
[null,"Cladoceran, Daphnia magna","S, M, T",220,7.6,1.6,null,38200,"Kimball 1978",null,{"$f":"EXP(LN(H77)-0.597*(LN(F77)-LN('Summary Sheet'!$C$6))-8.802*(E77-'Summary Sheet'!$C$4)-2.089*(LN(D77)-LN('Summary Sheet'!$C$5))+0.491*(E77^2-'Summary Sheet'!$C$4^2)+0.23*((E77*LN(D77)-'Summary Sheet'!$C$4*LN('Summary Sheet'!$C$5))))","v":26445.556844715487},null,null,"-",null,null,"Daphnia",null,"Value is from 2007 FW Cu AWQC Appendix C recommendation","Well water"]
[null,"Cladoceran, Daphnia magna","S, U, T",45.1,7.25,1.1000000000000001,null,2800,"Shephard 1983",null,{"$f":"EXP(LN(H78)-0.597*(LN(F78)-LN('Summary Sheet'!$C$6))-8.802*(E78-'Summary Sheet'!$C$4)-2.089*(LN(D78)-LN('Summary Sheet'!$C$5))+0.491*(E78^2-'Summary Sheet'!$C$4^2)+0.23*((E78*LN(D78)-'Summary Sheet'!$C$4*LN('Summary Sheet'!$C$5))))","v":5196.9643604921312},null,null,"-",null,null,"Daphnia",null,"Value is from 2007 FW Cu AWQC Appendix C recommendation","Lake Superior water (most likely raw)"]
[null,"Cladoceran, Daphnia magna","S, U, T",168,5.99,0.5,">",500,"European Al Association 2009",">",{"$f":"EXP(LN(H79)-0.597*(LN(F79)-LN('Summary Sheet'!$C$6))-8.802*(E79-'Summary Sheet'!$C$4)-2.089*(LN(D79)-LN('Summary Sheet'!$C$5))+0.491*(E79^2-'Summary Sheet'!$C$4^2)+0.23*((E79*LN(D79)-'Summary Sheet'!$C$4*LN('Summary Sheet'!$C$5))))","v":3512.2154231068266},null,null,"-",null,null,"Daphnia",null,"Value is from 2007 FW Cu AWQC Appendix C recommendation","Hard Lab Recon water"]
[null,"Cladoceran, Daphnia magna","S, U, T",168,6.98,0.5,">",500,"European Al Association 2009",">",{"$f":"EXP(LN(H80)-0.597*(LN(F80)-LN('Summary Sheet'!$C$6))-8.802*(E80-'Summary Sheet'!$C$4)-2.089*(LN(D80)-LN('Summary Sheet'!$C$5))+0.491*(E80^2-'Summary Sheet'!$C$4^2)+0.23*((E80*LN(D80)-'Summary Sheet'!$C$4*LN('Summary Sheet'!$C$5))))","v":1013.6735506302525},"c",null,"-",null,null,"Daphnia",null,"Value is from 2007 FW Cu AWQC Appendix C recommendation","Hard Lab Recon water"]
[null,"Cladoceran, Daphnia magna","S, U, T",168,7.93,0.5,">",500,"European Al Association 2009",">",{"$f":"EXP(LN(H81)-0.597*(LN(F81)-LN('Summary Sheet'!$C$6))-8.802*(E81-'Summary Sheet'!$C$4)-2.089*(LN(D81)-LN('Summary Sheet'!$C$5))+0.491*(E81^2-'Summary Sheet'!$C$4^2)+0.23*((E81*LN(D81)-'Summary Sheet'!$C$4*LN('Summary Sheet'!$C$5))))","v":760.35985880043438},"c",null,"-",null,null,"Daphnia",null,"Value is from 2007 FW Cu AWQC Appendix C recommendation","Hard Lab Recon water"]
[null,"Cladoceran, Daphnia magna","S, U, T",168,7.92,0.5,null,795.02,"European Al Association 2009",null,{"$f":"EXP(LN(H82)-0.597*(LN(F82)-LN('Summary Sheet'!$C$6))-8.802*(E82-'Summary Sheet'!$C$4)-2.089*(LN(D82)-LN('Summary Sheet'!$C$5))+0.491*(E82^2-'Summary Sheet'!$C$4^2)+0.23*((E82*LN(D82)-'Summary Sheet'!$C$4*LN('Summary Sheet'!$C$5))))","v":1207.0834724102533},null,null,"-",null,null,"Daphnia",null,"Value is from 2007 FW Cu AWQC Appendix C recommendation","Hard Lab Recon water"]
[null,"Cladoceran, Daphnia magna","S, U, T",168,7.95,2,">",1200,"European Al Association 2009",">",{"$f":"EXP(LN(H83)-0.597*(LN(F83)-LN('Summary Sheet'!$C$6))-8.802*(E83-'Summary Sheet'!$C$4)-2.089*(LN(D83)-LN('Summary Sheet'!$C$5))+0.491*(E83^2-'Summary Sheet'!$C$4^2)+0.23*((E83*LN(D83)-'Summary Sheet'!$C$4*LN('Summary Sheet'!$C$5))))","v":800.40244522413309},"c",null,"-",null,null,"Daphnia",null,"Value is from 2007 FW Cu AWQC Appendix C recommendation","Hard Lab Recon water"]
[null,"Cladoceran, Daphnia magna","S, U, T",168,7.93,3,">",1200,"European Al Association 2009",">",{"$f":"EXP(LN(H84)-0.597*(LN(F84)-LN('Summary Sheet'!$C$6))-8.802*(E84-'Summary Sheet'!$C$4)-2.089*(LN(D84)-LN('Summary Sheet'!$C$5))+0.491*(E84^2-'Summary Sheet'!$C$4^2)+0.23*((E84*LN(D84)-'Summary Sheet'!$C$4*LN('Summary Sheet'!$C$5))))","v":626.14386053649559},"c",null,{"$f":"GEOMEAN(K76:K79,K82)","v":4983.4217921862155},null,null,"Daphnia",null,"Value is from 2007 FW Cu AWQC Appendix C recommendation","Hard Lab Recon water"]
[]
[null,"Cladoceran, Daphnia pulex","R, U, T",142,8.1999999999999993,1.6,null,3650,"Griffitt et al. 2008",null,{"$f":"EXP(LN(H86)-0.597*(LN(F86)-LN('Summary Sheet'!$C$6))-8.802*(E86-'Summary Sheet'!$C$4)-2.089*(LN(D86)-LN('Summary Sheet'!$C$5))+0.491*(E86^2-'Summary Sheet'!$C$4^2)+0.23*((E86*LN(D86)-'Summary Sheet'!$C$4*LN('Summary Sheet'!$C$5))))","v":3106.9884518960657},null,null,{"$f":"GEOMEAN(K86)","v":3106.9884518960657},{"$f":"GEOMEAN(N76:N86)","v":3934.8994852791047},null,"Daphnia","Invert","Value is from 2007 FW Cu AWQC Appendix C recommendation","Tap water (Gainesville, FL)"]
[]
[null,"Ostracod, Stenocypris major","R, M, T",15.63,6.51,3.2,null,3101.96,"Shuhaimi-Othman et al. 2011a",null,{"$f":"EXP(LN(H88)-0.597*(LN(F88)-LN('Summary Sheet'!$C$6))-8.802*(E88-'Summary Sheet'!$C$4)-2.089*(LN(D88)-LN('Summary Sheet'!$C$5))+0.491*(E88^2-'Summary Sheet'!$C$4^2)+0.23*((E88*LN(D88)-'Summary Sheet'!$C$4*LN('Summary Sheet'!$C$5))))","v":13540.118913211649},null,null,{"$f":"K88","v":13540.118913211649},{"$f":"N88","v":13540.118913211649},null,"Stenocypris","Invert","Value is from Shuhaimi-Othman et al. 2013","Tap water (Malaysia)"]
[]
[null,"Amphipod, Crangonyx pseudogracilis","R, U, T",50,6.75,1.6,null,9190,"Martin and Holdich 1986",null,{"$f":"EXP(LN(H90)-0.597*(LN(F90)-LN('Summary Sheet'!$C$6))-8.802*(E90-'Summary Sheet'!$C$4)-2.089*(LN(D90)-LN('Summary Sheet'!$C$5))+0.491*(E90^2-'Summary Sheet'!$C$4^2)+0.23*((E90*LN(D90)-'Summary Sheet'!$C$4*LN('Summary Sheet'!$C$5))))","v":21835.186596560488},null,null,{"$f":"K90","v":21835.186596560488},{"$f":"N90","v":21835.186596560488},null,"Crangonyx","Invert","Value is from 2007 FW Cu AWQC Appendix C recommendation","Tap water (UK)"]
[]
[null,"Amphipod, Hyalella azteca","F, M, T",105,6.13,0.48,">",5997,"Wang et al. 2016, 2017",">",{"$f":"EXP(LN(H92)-0.597*(LN(F92)-LN('Summary Sheet'!$C$6))-8.802*(E92-'Summary Sheet'!$C$4)-2.089*(LN(D92)-LN('Summary Sheet'!$C$5))+0.491*(E92^2-'Summary Sheet'!$C$4^2)+0.23*((E92*LN(D92)-'Summary Sheet'!$C$4*LN('Summary Sheet'!$C$5))))","v":46995.139115055659},null,">",{"$f":"K92","v":46995.139115055659},{"$f":"N92","v":46995.139115055659},">","Hyalella","Invert","Author reported","Well water/deionized water mix"]
[]
[null,"Midge, Chironomus plumosus","S, U, T",80,7,1.6,null,30000,"Fargasova 2001, 2003",null,{"$f":"EXP(LN(H94)-0.597*(LN(F94)-LN('Summary Sheet'!$C$6))-8.802*(E94-'Summary Sheet'!$C$4)-2.089*(LN(D94)-LN('Summary Sheet'!$C$5))+0.491*(E94^2-'Summary Sheet'!$C$4^2)+0.23*((E94*LN(D94)-'Summary Sheet'!$C$4*LN('Summary Sheet'!$C$5))))","v":42679.822277453961},null,null,{"$f":"K94","v":42679.822277453961},{"$f":"N94","v":42679.822277453961},null,"Chironomus","Invert","Value is from 2007 FW Cu AWQC Appendix C recommendation","Tap water (Slovakia)"]
[]
[null,"Midge, Paratanytarsus dissimilis","S, M, T",17.43,7.28,2.8,">",77700,"Lamb and Bailey 1981, 1983",">",{"$f":"EXP(LN(H96)-0.597*(LN(F96)-LN('Summary Sheet'!$C$6))-8.802*(E96-'Summary Sheet'!$C$4)-2.089*(LN(D96)-LN('Summary Sheet'!$C$5))+0.491*(E96^2-'Summary Sheet'!$C$4^2)+0.23*((E96*LN(D96)-'Summary Sheet'!$C$4*LN('Summary Sheet'!$C$5))))","v":119573.57964259433},null,">",{"$f":"K96","v":119573.57964259433},{"$f":"N96","v":119573.57964259433},">","Paratanytarsus","Invert","Value is from 2007 FW Cu AWQC Appendix C recommendation","Liberty Lake, Washington (0.45 um filtered)"]
[]
[null,"Rainbow trout, Oncorhynchus mykiss","S, U, T",14.3,5,0.4,null,160,"Holtze 1983",null,{"$f":"EXP(LN(H98)-2.209*(LN(F98)-LN('Summary Sheet'!$C$6))-2.041*(E98-'Summary Sheet'!$C$4)-1.862*(LN(D98)-LN('Summary Sheet'!$C$5))+0.232*(E98*LN(D98)-'Summary Sheet'!$C$4*LN('Summary Sheet'!$C$5))+0.261*(E98*LN(F98)-'Summary Sheet'!$C$4*LN('Summary Sheet'!$C$6)))","v":13036.373235124094},"f",null,"-",null,null,"Oncorhynchus",null,"Author reported","Tap water (Lake Ontario)"]
[null,"Rainbow trout, Oncorhynchus mykiss","S, U, T",14.3,5.5,0.4,null,310,"Holtze 1983",null,{"$f":"EXP(LN(H99)-2.209*(LN(F99)-LN('Summary Sheet'!$C$6))-2.041*(E99-'Summary Sheet'!$C$4)-1.862*(LN(D99)-LN('Summary Sheet'!$C$5))+0.232*(E99*LN(D99)-'Summary Sheet'!$C$4*LN('Summary Sheet'!$C$5))+0.261*(E99*LN(F99)-'Summary Sheet'!$C$4*LN('Summary Sheet'!$C$6)))","v":10997.368751024371},"f",null,"-",null,null,"Oncorhynchus",null,"Author reported","Tap water (Lake Ontario)"]
[null,"Rainbow trout, Oncorhynchus mykiss","S, M, T",47.4,6.59,1.1000000000000001,null,7400,"Call et al. 1984",null,{"$f":"EXP(LN(H100)-2.209*(LN(F100)-LN('Summary Sheet'!$C$6))-2.041*(E100-'Summary Sheet'!$C$4)-1.862*(LN(D100)-LN('Summary Sheet'!$C$5))+0.232*(E100*LN(D100)-'Summary Sheet'!$C$4*LN('Summary Sheet'!$C$5))+0.261*(E100*LN(F100)-'Summary Sheet'!$C$4*LN('Summary Sheet'!$C$6)))","v":17527.978248363797},"f",null,"-",null,null,"Oncorhynchus",null,"Value is from personal communication with R. Erickson who works at the Lab","Raw Lake Superior water"]
[null,"Rainbow trout, Oncorhynchus mykiss","S, M, T",47.4,7.31,1.1000000000000001,null,14600,"Call et al. 1984",null,{"$f":"EXP(LN(H101)-2.209*(LN(F101)-LN('Summary Sheet'!$C$6))-2.041*(E101-'Summary Sheet'!$C$4)-1.862*(LN(D101)-LN('Summary Sheet'!$C$5))+0.232*(E101*LN(D101)-'Summary Sheet'!$C$4*LN('Summary Sheet'!$C$5))+0.261*(E101*LN(F101)-'Summary Sheet'!$C$4*LN('Summary Sheet'!$C$6)))","v":15429.400857441051},"f",null,"-",null,null,"Oncorhynchus",null,"Value is from personal communication with R. Erickson who works at the Lab","Raw Lake Superior water"]
[null,"Rainbow trout, Oncorhynchus mykiss","S, M, T",47.4,8.17,1.1000000000000001,">",24700,"Call et al. 1984",">",{"$f":"EXP(LN(H102)-2.209*(LN(F102)-LN('Summary Sheet'!$C$6))-2.041*(E102-'Summary Sheet'!$C$4)-1.862*(LN(D102)-LN('Summary Sheet'!$C$5))+0.232*(E102*LN(D102)-'Summary Sheet'!$C$4*LN('Summary Sheet'!$C$5))+0.261*(E102*LN(F102)-'Summary Sheet'!$C$4*LN('Summary Sheet'!$C$6)))","v":9954.8730082129623},"f",null,"-",null,null,"Oncorhynchus",null,"Value is from personal communication with R. Erickson who works at the Lab","Raw Lake Superior water"]
[null,"Rainbow trout, Oncorhynchus mykiss","S, M, T",47.4,7.46,1.1000000000000001,null,8600,"Call et al. 1984",null,{"$f":"EXP(LN(H103)-2.209*(LN(F103)-LN('Summary Sheet'!$C$6))-2.041*(E103-'Summary Sheet'!$C$4)-1.862*(LN(D103)-LN('Summary Sheet'!$C$5))+0.232*(E103*LN(D103)-'Summary Sheet'!$C$4*LN('Summary Sheet'!$C$5))+0.261*(E103*LN(F103)-'Summary Sheet'!$C$4*LN('Summary Sheet'!$C$6)))","v":7681.9771662269768},"f",null,"-",null,null,"Oncorhynchus",null,"Value is from personal communication with R. Erickson who works at the Lab","Raw Lake Superior water"]
[null,"Rainbow trout, Oncorhynchus mykiss","F, M, T",26.35,7.61,0.5,">",9840,"Gundersen et al. 1994",">",{"$f":"EXP(LN(H104)-2.209*(LN(F104)-LN('Summary Sheet'!$C$6))-2.041*(E104-'Summary Sheet'!$C$4)-1.862*(LN(D104)-LN('Summary Sheet'!$C$5))+0.232*(E104*LN(D104)-'Summary Sheet'!$C$4*LN('Summary Sheet'!$C$5))+0.261*(E104*LN(F104)-'Summary Sheet'!$C$4*LN('Summary Sheet'!$C$6)))","v":9372.1351505842231},null,null,"-",null,null,"Oncorhynchus",null,"Value is from 2007 FW Cu AWQC Appendix C recommendation","Reverse Osmosis treated well water: then added salts"]
[null,"Rainbow trout, Oncorhynchus mykiss","F, M, T",45.5,7.59,0.5,">",8070,"Gundersen et al. 1994",">",{"$f":"EXP(LN(H105)-2.209*(LN(F105)-LN('Summary Sheet'!$C$6))-2.041*(E105-'Summary Sheet'!$C$4)-1.862*(LN(D105)-LN('Summary Sheet'!$C$5))+0.232*(E105*LN(D105)-'Summary Sheet'!$C$4*LN('Summary Sheet'!$C$5))+0.261*(E105*LN(F105)-'Summary Sheet'!$C$4*LN('Summary Sheet'!$C$6)))","v":7489.1936097895314},null,null,"-",null,null,"Oncorhynchus",null,"Value is from 2007 FW Cu AWQC Appendix C recommendation","Reverse Osmosis treated well water: then added salts"]
[null,"Rainbow trout, Oncorhynchus mykiss","F, M, T",88.05,7.6,0.5,">",8160,"Gundersen et al. 1994",">",{"$f":"EXP(LN(H106)-2.209*(LN(F106)-LN('Summary Sheet'!$C$6))-2.041*(E106-'Summary Sheet'!$C$4)-1.862*(LN(D106)-LN('Summary Sheet'!$C$5))+0.232*(E106*LN(D106)-'Summary Sheet'!$C$4*LN('Summary Sheet'!$C$5))+0.261*(E106*LN(F106)-'Summary Sheet'!$C$4*LN('Summary Sheet'!$C$6)))","v":7000.3683895568993},null,null,"-",null,null,"Oncorhynchus",null,"Value is from 2007 FW Cu AWQC Appendix C recommendation","Reverse Osmosis treated well water: then added salts"]
[null,"Rainbow trout, Oncorhynchus mykiss","F, M, T",127.6,7.61,0.5,">",8200,"Gundersen et al. 1994",">",{"$f":"EXP(LN(H107)-2.209*(LN(F107)-LN('Summary Sheet'!$C$6))-2.041*(E107-'Summary Sheet'!$C$4)-1.862*(LN(D107)-LN('Summary Sheet'!$C$5))+0.232*(E107*LN(D107)-'Summary Sheet'!$C$4*LN('Summary Sheet'!$C$5))+0.261*(E107*LN(F107)-'Summary Sheet'!$C$4*LN('Summary Sheet'!$C$6)))","v":6707.5163159614749},null,null,"-",null,null,"Oncorhynchus",null,"Value is from 2007 FW Cu AWQC Appendix C recommendation","Reverse Osmosis treated well water: then added salts"]
[null,"Rainbow trout, Oncorhynchus mykiss","F, M, T",23.25,8.2799999999999994,0.5,null,6170,"Gundersen et al. 1994",null,{"$f":"EXP(LN(H108)-2.209*(LN(F108)-LN('Summary Sheet'!$C$6))-2.041*(E108-'Summary Sheet'!$C$4)-1.862*(LN(D108)-LN('Summary Sheet'!$C$5))+0.232*(E108*LN(D108)-'Summary Sheet'!$C$4*LN('Summary Sheet'!$C$5))+0.261*(E108*LN(F108)-'Summary Sheet'!$C$4*LN('Summary Sheet'!$C$6)))","v":2188.9912698954781},null,null,"-",null,null,"Oncorhynchus",null,"Value is from 2007 FW Cu AWQC Appendix C recommendation","Reverse Osmosis treated well water: then added salts"]
[null,"Rainbow trout, Oncorhynchus mykiss","F, M, T",35.4,8.3000000000000007,0.5,null,6170,"Gundersen et al. 1994",null,{"$f":"EXP(LN(H109)-2.209*(LN(F109)-LN('Summary Sheet'!$C$6))-2.041*(E109-'Summary Sheet'!$C$4)-1.862*(LN(D109)-LN('Summary Sheet'!$C$5))+0.232*(E109*LN(D109)-'Summary Sheet'!$C$4*LN('Summary Sheet'!$C$5))+0.261*(E109*LN(F109)-'Summary Sheet'!$C$4*LN('Summary Sheet'!$C$6)))","v":2182.2126153726485},null,null,"-",null,null,"Oncorhynchus",null,"Value is from 2007 FW Cu AWQC Appendix C recommendation","Reverse Osmosis treated well water: then added salts"]
[null,"Rainbow trout, Oncorhynchus mykiss","F, M, T",83.6,8.31,0.5,null,7670,"Gundersen et al. 1994",null,{"$f":"EXP(LN(H110)-2.209*(LN(F110)-LN('Summary Sheet'!$C$6))-2.041*(E110-'Summary Sheet'!$C$4)-1.862*(LN(D110)-LN('Summary Sheet'!$C$5))+0.232*(E110*LN(D110)-'Summary Sheet'!$C$4*LN('Summary Sheet'!$C$5))+0.261*(E110*LN(F110)-'Summary Sheet'!$C$4*LN('Summary Sheet'!$C$6)))","v":2831.0846411744146},null,null,"-",null,null,"Oncorhynchus",null,"Value is from 2007 FW Cu AWQC Appendix C recommendation","Reverse Osmosis treated well water: then added salts"]
[null,"Rainbow trout, Oncorhynchus mykiss","F, M, T",128.5,8.31,0.5,null,6930,"Gundersen et al. 1994",null,{"$f":"EXP(LN(H111)-2.209*(LN(F111)-LN('Summary Sheet'!$C$6))-2.041*(E111-'Summary Sheet'!$C$4)-1.862*(LN(D111)-LN('Summary Sheet'!$C$5))+0.232*(E111*LN(D111)-'Summary Sheet'!$C$4*LN('Summary Sheet'!$C$5))+0.261*(E111*LN(F111)-'Summary Sheet'!$C$4*LN('Summary Sheet'!$C$6)))","v":2631.4661070264651},null,null,{"$f":"GEOMEAN(K104:K111)","v":4301.8572500674654},{"$f":"N111","v":4301.8572500674654},null,"Oncorhynchus","Fish","Value is from 2007 FW Cu AWQC Appendix C recommendation","Reverse Osmosis treated well water: then added salts"]
[]
[null,"Atlantic salmon, Salmo salar","S, U, T",6.8,5.5,0.5,null,584,"Hamilton and Haines 1995",null,{"$f":"EXP(LN(H113)-2.209*(LN(F113)-LN('Summary Sheet'!$C$6))-2.041*(E113-'Summary Sheet'!$C$4)-1.862*(LN(D113)-LN('Summary Sheet'!$C$5))+0.232*(E113*LN(D113)-'Summary Sheet'!$C$4*LN('Summary Sheet'!$C$5))+0.261*(E113*LN(F113)-'Summary Sheet'!$C$4*LN('Summary Sheet'!$C$6)))","v":26949.874113709393},null,null,"-",null,null,"Salmo",null,"Value is from 2007 FW Cu AWQC Appendix C recommendation","Soft Lab Recon water"]
[null,"Atlantic salmon, Salmo salar","S, U, T",6.8,6.5,0.5,null,599,"Hamilton and Haines 1995",null,{"$f":"EXP(LN(H114)-2.209*(LN(F114)-LN('Summary Sheet'!$C$6))-2.041*(E114-'Summary Sheet'!$C$4)-1.862*(LN(D114)-LN('Summary Sheet'!$C$5))+0.232*(E114*LN(D114)-'Summary Sheet'!$C$4*LN('Summary Sheet'!$C$5))+0.261*(E114*LN(F114)-'Summary Sheet'!$C$4*LN('Summary Sheet'!$C$6)))","v":4674.6480357037954},null,null,{"$f":"GEOMEAN(K113:K114)","v":11224.133645324979},{"$f":"N114","v":11224.133645324979},null,"Salmo","Fish","Value is from 2007 FW Cu AWQC Appendix C recommendation","Soft Lab Recon water"]
[]
[null,"Brook trout, Salvelinus fontinalis","F, M, T","-",6.5,"-",null,3600,"Decker and Menendez 1974",null,"NAe",null,null,"-",null,null,"Salvelinus",null,"-","Tap water (Elkins, WV)"]
[null,"Brook trout, Salvelinus fontinalis","F, M, T","-",6,"-",null,4400,"Decker and Menendez 1974",null,"NAe",null,null,"-",null,null,"Salvelinus",null,"-","Tap water (Elkins, WV)"]
[null,"Brook trout, Salvelinus fontinalis","F, M, T","-",5.5,"-",null,4000,"Decker and Menendez 1974",null,"NAe",null,null,"-",null,null,"Salvelinus",null,"-","Tap water (Elkins, WV)"]
[null,"Brook trout, Salvelinus fontinalis","S, U, T",40,5.6,1.6,null,6530,"Tandjung 1982",null,{"$f":"EXP(LN(H119)-2.209*(LN(F119)-LN('Summary Sheet'!$C$6))-2.041*(E119-'Summary Sheet'!$C$4)-1.862*(LN(D119)-LN('Summary Sheet'!$C$5))+0.232*(E119*LN(D119)-'Summary Sheet'!$C$4*LN('Summary Sheet'!$C$5))+0.261*(E119*LN(F119)-'Summary Sheet'!$C$4*LN('Summary Sheet'!$C$6)))","v":39014.177393557322},null,null,"-",null,null,"Salvelinus",null,"Value is from 2007 FW Cu AWQC Appendix C recommendation","Well water/distilled water mix"]
[null,"Brook trout, Salvelinus fontinalis","S, U, T",18,5.6,1.6,null,3400,"Tandjung 1982",null,{"$f":"EXP(LN(H120)-2.209*(LN(F120)-LN('Summary Sheet'!$C$6))-2.041*(E120-'Summary Sheet'!$C$4)-1.862*(LN(D120)-LN('Summary Sheet'!$C$5))+0.232*(E120*LN(D120)-'Summary Sheet'!$C$4*LN('Summary Sheet'!$C$5))+0.261*(E120*LN(F120)-'Summary Sheet'!$C$4*LN('Summary Sheet'!$C$6)))","v":31839.056332801232},null,null,"-",null,null,"Salvelinus",null,"Value is from 2007 FW Cu AWQC Appendix C recommendation","Well water/distilled water mix"]
[null,"Brook trout, Salvelinus fontinalis","S, U, T",2,5.6,1.6,null,370,"Tandjung 1982",null,{"$f":"EXP(LN(H121)-2.209*(LN(F121)-LN('Summary Sheet'!$C$6))-2.041*(E121-'Summary Sheet'!$C$4)-1.862*(LN(D121)-LN('Summary Sheet'!$C$5))+0.232*(E121*LN(D121)-'Summary Sheet'!$C$4*LN('Summary Sheet'!$C$5))+0.261*(E121*LN(F121)-'Summary Sheet'!$C$4*LN('Summary Sheet'!$C$6)))","v":11932.47899892579},null,null,{"$f":"GEOMEAN(K119:K121)","v":24564.302681408841},{"$f":"N121","v":24564.302681408841},null,"Salvelinus","Fish","Value is from 2007 FW Cu AWQC Appendix C recommendation","Well water/distilled water mix"]
[]
[null,"Green sunfish, Lepomis cyanellus","S, M, T",47.4,7.55,1.1000000000000001,">",50000,"Call et al. 1984",">",{"$f":"EXP(LN(H123)-2.209*(LN(F123)-LN('Summary Sheet'!$C$6))-2.041*(E123-'Summary Sheet'!$C$4)-1.862*(LN(D123)-LN('Summary Sheet'!$C$5))+0.232*(E123*LN(D123)-'Summary Sheet'!$C$4*LN('Summary Sheet'!$C$5))+0.261*(E123*LN(F123)-'Summary Sheet'!$C$4*LN('Summary Sheet'!$C$6)))","v":40376.770338445283},null,">",{"$f":"K123","v":40376.770338445283},{"$f":"N123","v":40376.770338445283},">","Lepomis","Fish","Value is from 2007 FW Cu AWQC Appendix C recommendation","Raw Lake Superior water"]
[]
[null,"Guppy, Poecilia reticulata","R, M, T",18.72,6.68,3.2,null,6760,"Shuhaimi-Othman et al. 2013",null,{"$f":"EXP(LN(H125)-2.209*(LN(F125)-LN('Summary Sheet'!$C$6))-2.041*(E125-'Summary Sheet'!$C$4)-1.862*(LN(D125)-LN('Summary Sheet'!$C$5))+0.232*(E125*LN(D125)-'Summary Sheet'!$C$4*LN('Summary Sheet'!$C$5))+0.261*(E125*LN(F125)-'Summary Sheet'!$C$4*LN('Summary Sheet'!$C$6)))","v":11768.626281177572},null,null,{"$f":"GEOMEAN(K125)","v":11768.626281177572},{"$f":"N125","v":11768.626281177572},null,"Poecilia","Fish","Author reported","Tap water (Malaysia)"]
[]
[null,"Rio Grande silvery minnow, Hybognathus amarus","R, M, T",140,8.1,0.5,">",59100,"Buhl 2002",">",{"$f":"EXP(LN(H127)-2.209*(LN(F127)-LN('Summary Sheet'!$C$6))-2.041*(E127-'Summary Sheet'!$C$4)-1.862*(LN(D127)-LN('Summary Sheet'!$C$5))+0.232*(E127*LN(D127)-'Summary Sheet'!$C$4*LN('Summary Sheet'!$C$5))+0.261*(E127*LN(F127)-'Summary Sheet'!$C$4*LN('Summary Sheet'!$C$6)))","v":28287.133948670376},null,">",{"$f":"K127","v":28287.133948670376},{"$f":"N127","v":28287.133948670376},">","Hybognathus","Fish","Value is from 2007 FW Cu AWQC Appendix C recommendation","Lab Recon water (recipe different from EPA)"]
[]
[null,"Fathead minnow, Pimephales promelas","S, U, NR","-",7.6,"-",">",18900,"Boyd 1979",null,"NAe",null,null,"-",null,null,"Pimephales",null,"-"]
[null,"Fathead minnow, Pimephales promelas","S, M, T",47.4,7.61,1.1000000000000001,">",48200,"Call et al. 1984",">",{"$f":"EXP(LN(H130)-2.209*(LN(F130)-LN('Summary Sheet'!$C$6))-2.041*(E130-'Summary Sheet'!$C$4)-1.862*(LN(D130)-LN('Summary Sheet'!$C$5))+0.232*(E130*LN(D130)-'Summary Sheet'!$C$4*LN('Summary Sheet'!$C$5))+0.261*(E130*LN(F130)-'Summary Sheet'!$C$4*LN('Summary Sheet'!$C$6)))","v":36391.499692531499},null,null,"-",null,null,"Pimephales",null,"Value is from 2007 FW Cu AWQC Appendix C recommendation","Raw Lake Superior water"]
[null,"Fathead minnow, Pimephales promelas","S, M, T",47.4,8.0500000000000007,1.1000000000000001,">",49800,"Call et al. 1984",">",{"$f":"EXP(LN(H131)-2.209*(LN(F131)-LN('Summary Sheet'!$C$6))-2.041*(E131-'Summary Sheet'!$C$4)-1.862*(LN(D131)-LN('Summary Sheet'!$C$5))+0.232*(E131*LN(D131)-'Summary Sheet'!$C$4*LN('Summary Sheet'!$C$5))+0.261*(E131*LN(F131)-'Summary Sheet'!$C$4*LN('Summary Sheet'!$C$6)))","v":22960.716182204927},null,null,"-",null,null,"Pimephales",null,"Value is from 2007 FW Cu AWQC Appendix C recommendation","Raw Lake Superior water"]
[null,"Fathead minnow, Pimephales promelas","F, U, T",21.6,6.5,0.9,">",400,"Palmer et al. 1989",">",{"$f":"EXP(LN(H132)-2.209*(LN(F132)-LN('Summary Sheet'!$C$6))-2.041*(E132-'Summary Sheet'!$C$4)-1.862*(LN(D132)-LN('Summary Sheet'!$C$5))+0.232*(E132*LN(D132)-'Summary Sheet'!$C$4*LN('Summary Sheet'!$C$5))+0.261*(E132*LN(F132)-'Summary Sheet'!$C$4*LN('Summary Sheet'!$C$6)))","v":1534.1451616535792},"c",null,"-",null,null,"Pimephales",null,"Author reported","Well water/deionized water mix"]
[null,"Fathead minnow, Pimephales promelas","F, U, T",21.6,7.5,0.9,">",400,"Palmer et al. 1989",">",{"$f":"EXP(LN(H133)-2.209*(LN(F133)-LN('Summary Sheet'!$C$6))-2.041*(E133-'Summary Sheet'!$C$4)-1.862*(LN(D133)-LN('Summary Sheet'!$C$5))+0.232*(E133*LN(D133)-'Summary Sheet'!$C$4*LN('Summary Sheet'!$C$5))+0.261*(E133*LN(F133)-'Summary Sheet'!$C$4*LN('Summary Sheet'!$C$6)))","v":395.47768421153984},"c",null,"-",null,null,"Pimephales",null,"Author reported","Well water/deionized water mix"]
[null,"Fathead minnow, Pimephales promelas","F, U, T",21.6,7.5,0.9,">",400,"Palmer et al. 1989",">",{"$f":"EXP(LN(H134)-2.209*(LN(F134)-LN('Summary Sheet'!$C$6))-2.041*(E134-'Summary Sheet'!$C$4)-1.862*(LN(D134)-LN('Summary Sheet'!$C$5))+0.232*(E134*LN(D134)-'Summary Sheet'!$C$4*LN('Summary Sheet'!$C$5))+0.261*(E134*LN(F134)-'Summary Sheet'!$C$4*LN('Summary Sheet'!$C$6)))","v":395.47768421153984},"c",null,"-",null,null,"Pimephales",null,"Author reported","Well water/deionized water mix"]
[null,"Fathead minnow, Pimephales promelas","F, U, T",21.6,6.5,0.9,">",400,"Palmer et al. 1989",">",{"$f":"EXP(LN(H135)-2.209*(LN(F135)-LN('Summary Sheet'!$C$6))-2.041*(E135-'Summary Sheet'!$C$4)-1.862*(LN(D135)-LN('Summary Sheet'!$C$5))+0.232*(E135*LN(D135)-'Summary Sheet'!$C$4*LN('Summary Sheet'!$C$5))+0.261*(E135*LN(F135)-'Summary Sheet'!$C$4*LN('Summary Sheet'!$C$6)))","v":1534.1451616535792},"c",null,"-",null,null,"Pimephales",null,"Author reported","Well water/deionized water mix"]
[null,"Fathead minnow, Pimephales promelas","F, U, T",21.6,7.5,0.9,">",400,"Palmer et al. 1989",">",{"$f":"EXP(LN(H136)-2.209*(LN(F136)-LN('Summary Sheet'!$C$6))-2.041*(E136-'Summary Sheet'!$C$4)-1.862*(LN(D136)-LN('Summary Sheet'!$C$5))+0.232*(E136*LN(D136)-'Summary Sheet'!$C$4*LN('Summary Sheet'!$C$5))+0.261*(E136*LN(F136)-'Summary Sheet'!$C$4*LN('Summary Sheet'!$C$6)))","v":395.47768421153984},"c",null,"-",null,null,"Pimephales",null,"Author reported","Well water/deionized water mix"]
[null,"Fathead minnow, Pimephales promelas","R, M, T",140,8.1,0.5,">",59100,"Buhl 2002",">",{"$f":"EXP(LN(H137)-2.209*(LN(F137)-LN('Summary Sheet'!$C$6))-2.041*(E137-'Summary Sheet'!$C$4)-1.862*(LN(D137)-LN('Summary Sheet'!$C$5))+0.232*(E137*LN(D137)-'Summary Sheet'!$C$4*LN('Summary Sheet'!$C$5))+0.261*(E137*LN(F137)-'Summary Sheet'!$C$4*LN('Summary Sheet'!$C$6)))","v":28287.133948670376},null,">",{"$f":"GEOMEAN(K130:K131,K137:K137)","v":28698.428126809416},{"$f":"N137","v":28698.428126809416},">","Pimephales","Fish","Value is from 2007 FW Cu AWQC Appendix C recommendation","Lab Recon water (recipe different from EPA)"]
[]
[null,"Smallmouth bass, Micropterus dolomieui","S, M, T",12.15,5.05,1.6,null,130,"Kane 1984; Kane and Rabeni 1987",null,{"$f":"EXP(LN(H139)-2.209*(LN(F139)-LN('Summary Sheet'!$C$6))-2.041*(E139-'Summary Sheet'!$C$4)-1.862*(LN(D139)-LN('Summary Sheet'!$C$5))+0.232*(E139*LN(D139)-'Summary Sheet'!$C$4*LN('Summary Sheet'!$C$5))+0.261*(E139*LN(F139)-'Summary Sheet'!$C$4*LN('Summary Sheet'!$C$6)))","v":3171.877259842413},null,null,"-",null,null,"Micropterus",null,"Value is from 2007 FW Cu AWQC Appendix C recommendation","Well water/deionized water mix"]
[null,"Smallmouth bass, Micropterus dolomieui","S, M, T",12.4,6.25,1.6,">",978.4,"Kane 1984; Kane and Rabeni 1987",">",{"$f":"EXP(LN(H140)-2.209*(LN(F140)-LN('Summary Sheet'!$C$6))-2.041*(E140-'Summary Sheet'!$C$4)-1.862*(LN(D140)-LN('Summary Sheet'!$C$5))+0.232*(E140*LN(D140)-'Summary Sheet'!$C$4*LN('Summary Sheet'!$C$5))+0.261*(E140*LN(F140)-'Summary Sheet'!$C$4*LN('Summary Sheet'!$C$6)))","v":4747.309283188657},null,null,"-",null,null,"Micropterus",null,"Value is from 2007 FW Cu AWQC Appendix C recommendation","Well water/deionized water mix"]
[null,"Smallmouth bass, Micropterus dolomieui","S, M, T",12,7.5,1.6,">",216.8,"Kane 1984; Kane and Rabeni 1987",">",{"$f":"EXP(LN(H141)-2.209*(LN(F141)-LN('Summary Sheet'!$C$6))-2.041*(E141-'Summary Sheet'!$C$4)-1.862*(LN(D141)-LN('Summary Sheet'!$C$5))+0.232*(E141*LN(D141)-'Summary Sheet'!$C$4*LN('Summary Sheet'!$C$5))+0.261*(E141*LN(F141)-'Summary Sheet'!$C$4*LN('Summary Sheet'!$C$6)))","v":199.26009362980898},"c",null,{"$f":"GEOMEAN(K139:K140)","v":3880.4487318846113},{"$f":"N141","v":3880.4487318846113},null,"Micropterus","Fish","Value is from 2007 FW Cu AWQC Appendix C recommendation","Well water/deionized water mix"]
[]
[null,"Green tree frog, Hyla cinerea","R, M, T",4.55,5.49,0.5,">",405.2,"Jung and Jagoe 1995",">",{"$f":"EXP(LN(H143)-2.209*(LN(F143)-LN('Summary Sheet'!$C$6))-2.041*(E143-'Summary Sheet'!$C$4)-1.862*(LN(D143)-LN('Summary Sheet'!$C$5))+0.232*(E143*LN(D143)-'Summary Sheet'!$C$4*LN('Summary Sheet'!$C$5))+0.261*(E143*LN(F143)-'Summary Sheet'!$C$4*LN('Summary Sheet'!$C$6)))","v":24109.706698213042},null,">",{"$f":"K143","v":24109.706698213042},{"$f":"N143","v":24109.706698213042},">","Hyla","Amphibian","Value is from 2007 FW Cu AWQC Appendix C recommendation","Very Soft Recon Lab water (recipe different from EPA)"]
[null,"a S=static, F=flow-through, U=unmeasured, M=measured, A=acid exchangeable aluminum, T=total aluminum, D=dissolved aluminum, NR=not reported."]
[null,"b Normalized to pH 7, hardness of 100 mg/L as CaCO3 and DOC of 1 mg/L (see Section 2.7.1). Values in bold are used in SMAV calculation."]
[null,"c Not used to calculate SMAV because either a more definitive value is available or value is considered an outlier."]
[null,"d When definitive DOC values were not reported by the authors: a DOC value of 0.5 mg/L was used when dilution water was reconstituted, 1.1 mg/L when dilution water was Lake Superior, MN water, 2.8 mg/L when dilution water was Liberty Lake, WA water, 1.6 mg/L when dilution water was tap or well water, or half the detection limit when the reported value was less than the detection limit, based on recommendations in the 2007 Freshwater Copper AWQC (U.S. EPA 2007b)."]
[null,"e Missing water quality parameters and/or dilution water type needed to estimate water quality parameters, so values cannot be normalized."]
[null,"f Not used to calculate SMAV because flow-through measure test(s) available.",null,null,null,null,null,null,null,null," "]
[null,"g Phosphate in exposure media is providing an ameliorating effect against aluminum. "]

{"sheet":"Chronic Dataset","index":5,"n_rows":82,"n_cols":20,"rows_kept":82,"cut":false,"hidden":false,"merged":[]}
[null,"Appendix C. Acceptable Chronic Toxicity Data of Aluminum to Freshwater Aquatic Animals"]
[null,null,null,null,null,null,null,null,null,null,"Values in bold used in SMAV calculation"]
[null,"Species","Total Hardness (mg/L as CaCO3)","pH","DOC\n(mg/L)","EC20 Endpoint",null,"EC20\n(µg/L)","Reference",null,"Normalized Conc.- EC20\n(µg/L)","Reason excluded from SMCV",null,"SMCV-EC20\n(µg/L)","GMCV-EC20\n(µg/L)",null,"Genus",null,"DOC Notes","Dilution water"]
[]
[null,"Oligochaete, Aeolosoma sp.",48,5.95,0.25,"Reproduction (population size)",null,1235,"OSU 2012e; Cardwell et al. 2018",null,{"$f":"EXP(LN(H5)-0.597*(LN(E5)-LN('Summary Sheet'!$C$6))-8.802*(D5-'Summary Sheet'!$C$4)-2.089*(LN(C5)-LN('Summary Sheet'!$C$5))+0.491*(D5^2-'Summary Sheet'!$C$4^2)+0.23*(D5*LN(C5)-'Summary Sheet'!$C$4*LN('Summary Sheet'!$C$5)))","v":34720.40938168201},null,null,{"$f":"K5","v":34720.40938168201},{"$f":"N5","v":34720.40938168201},null,"Aeolosoma","Invert","Author reported; half the detection limit","Soft Lab Recon water"]
[]
[null,"Rotifer, Brachionus calyciflorus",100,6.45,0.25,"Reproduction (population size)",null,431,"OSU 2012c; Cardwell et al. 2018",null,{"$f":"EXP(LN(H7)-0.597*(LN(E7)-LN('Summary Sheet'!$C$6))-8.802*(D7-'Summary Sheet'!$C$4)-2.089*(LN(C7)-LN('Summary Sheet'!$C$5))+0.491*(D7^2-'Summary Sheet'!$C$4^2)+0.23*(D7*LN(C7)-'Summary Sheet'!$C$4*LN('Summary Sheet'!$C$5)))","v":3122.3293270569825},null,null,null,null,null,"Brachionus",null,"Author reported; half the detection limit","Mod Hard Lab Recon water"]
[null,"Rotifer, Brachionus calyciflorus",63,6.3,1.39,"Reproduction (population size)",null,1751,"OSU 2018e",null,{"$f":"EXP(LN(H8)-0.597*(LN(E8)-LN('Summary Sheet'!$C$6))-8.802*(D8-'Summary Sheet'!$C$4)-2.089*(LN(C8)-LN('Summary Sheet'!$C$5))+0.491*(D8^2-'Summary Sheet'!$C$4^2)+0.23*(D8*LN(C8)-'Summary Sheet'!$C$4*LN('Summary Sheet'!$C$5)))","v":7646.8079301684875},null,null,null,null,null,"Brachionus",null,"Author reported","Recon Lab water"]
[null,"Rotifer, Brachionus calyciflorus",105,6.3,1.39,"Reproduction (population size)",null,2066,"OSU 2018e",null,{"$f":"EXP(LN(H9)-0.597*(LN(E9)-LN('Summary Sheet'!$C$6))-8.802*(D9-'Summary Sheet'!$C$4)-2.089*(LN(C9)-LN('Summary Sheet'!$C$5))+0.491*(D9^2-'Summary Sheet'!$C$4^2)+0.23*(D9*LN(C9)-'Summary Sheet'!$C$4*LN('Summary Sheet'!$C$5)))","v":6506.4059015832954},null,null,null,null,null,"Brachionus",null,"Author reported","Recon Lab water"]
[null,"Rotifer, Brachionus calyciflorus",114,6.2,2.63,"Reproduction (population size)",null,3061,"OSU 2018e",null,{"$f":"EXP(LN(H10)-0.597*(LN(E10)-LN('Summary Sheet'!$C$6))-8.802*(D10-'Summary Sheet'!$C$4)-2.089*(LN(C10)-LN('Summary Sheet'!$C$5))+0.491*(D10^2-'Summary Sheet'!$C$4^2)+0.23*(D10*LN(C10)-'Summary Sheet'!$C$4*LN('Summary Sheet'!$C$5)))","v":7316.2985525484819},null,null,null,null,null,"Brachionus",null,"Author reported","Recon Lab water"]
[null,"Rotifer, Brachionus calyciflorus",105,6.1,3.77,"Reproduction (population size)",null,4670,"OSU 2018e",null,{"$f":"EXP(LN(H11)-0.597*(LN(E11)-LN('Summary Sheet'!$C$6))-8.802*(D11-'Summary Sheet'!$C$4)-2.089*(LN(C11)-LN('Summary Sheet'!$C$5))+0.491*(D11^2-'Summary Sheet'!$C$4^2)+0.23*(D11*LN(C11)-'Summary Sheet'!$C$4*LN('Summary Sheet'!$C$5)))","v":11260.491827835447},null,null,null,null,null,"Brachionus",null,"Author reported","Recon Lab water"]
[null,"Rotifer, Brachionus calyciflorus",185,6.3,1.33,"Reproduction (population size)",null,1604,"OSU 2018e",null,{"$f":"EXP(LN(H12)-0.597*(LN(E12)-LN('Summary Sheet'!$C$6))-8.802*(D12-'Summary Sheet'!$C$4)-2.089*(LN(C12)-LN('Summary Sheet'!$C$5))+0.491*(D12^2-'Summary Sheet'!$C$4^2)+0.23*(D12*LN(C12)-'Summary Sheet'!$C$4*LN('Summary Sheet'!$C$5)))","v":3609.3321608671181},null,null,{"$f":"GEOMEAN(K7:K12)","v":5990.0338819298604},{"$f":"N12","v":5990.0338819298604},null,"Brachionus","Invert","Author reported","Recon Lab water"]
[]
[null,"Great pond snail, Lymnaea stagnalis",117,6,0.25,"Biomass",null,745.7,"OSU 2012b; Cardwell et al. 2018",null,{"$f":"EXP(LN(H14)-0.597*(LN(E14)-LN('Summary Sheet'!$C$6))-8.802*(D14-'Summary Sheet'!$C$4)-2.089*(LN(C14)-LN('Summary Sheet'!$C$5))+0.491*(D14^2-'Summary Sheet'!$C$4^2)+0.23*(D14*LN(C14)-'Summary Sheet'!$C$4*LN('Summary Sheet'!$C$5)))","v":10063.513062994862},null,null,null,null,null,"Lymnaea",null,"Author reported; half the detection limit","Recon Lab water (between mod hard and hard)"]
[null,"Great pond snail, Lymnaea stagnalis",121,6.15,1.37,"Biomass",null,833.42,"OSU 2018f",null,{"$f":"EXP(LN(H15)-0.597*(LN(E15)-LN('Summary Sheet'!$C$6))-8.802*(D15-'Summary Sheet'!$C$4)-2.089*(LN(C15)-LN('Summary Sheet'!$C$5))+0.491*(D15^2-'Summary Sheet'!$C$4^2)+0.23*(D15*LN(C15)-'Summary Sheet'!$C$4*LN('Summary Sheet'!$C$5)))","v":3067.1199936222179},null,null,null,null,null,"Lymnaea",null,"Author reported","Recon Lab water"]
[null,"Great pond snail, Lymnaea stagnalis",124,6.17,1.45,"Biomass",null,1950.6,"OSU 2018f",null,{"$f":"EXP(LN(H16)-0.597*(LN(E16)-LN('Summary Sheet'!$C$6))-8.802*(D16-'Summary Sheet'!$C$4)-2.089*(LN(C16)-LN('Summary Sheet'!$C$5))+0.491*(D16^2-'Summary Sheet'!$C$4^2)+0.23*(D16*LN(C16)-'Summary Sheet'!$C$4*LN('Summary Sheet'!$C$5)))","v":6604.8792679967019},null,null,null,null,null,"Lymnaea",null,"Author reported","Recon Lab water"]
[null,"Great pond snail, Lymnaea stagnalis",117,5.98,3.85,"Biomass",null,1392.4,"OSU 2018f",null,{"$f":"EXP(LN(H17)-0.597*(LN(E17)-LN('Summary Sheet'!$C$6))-8.802*(D17-'Summary Sheet'!$C$4)-2.089*(LN(C17)-LN('Summary Sheet'!$C$5))+0.491*(D17^2-'Summary Sheet'!$C$4^2)+0.23*(D17*LN(C17)-'Summary Sheet'!$C$4*LN('Summary Sheet'!$C$5)))","v":3809.3177044648023},null,null,{"$f":"GEOMEAN(K14:K17)","v":5278.9568861662583},{"$f":"N17","v":5278.9568861662583},null,"Lymnaea","Mollusk","Author reported","Recon Lab water"]
[]
[null,"Fatmucket, Lampsilis siliquoidea",105.5,6.04,{"$f":"AVERAGE(0.34,0.45)","v":0.39500000000000002},"Biomass",null,169,"Wang et al. 2016, 2018",null,{"$f":"EXP(LN(H19)-0.597*(LN(E19)-LN('Summary Sheet'!$C$6))-8.802*(D19-'Summary Sheet'!$C$4)-2.089*(LN(C19)-LN('Summary Sheet'!$C$5))+0.491*(D19^2-'Summary Sheet'!$C$4^2)+0.23*(D19*LN(C19)-'Summary Sheet'!$C$4*LN('Summary Sheet'!$C$5)))","v":1736.7403884458131},null,null,{"$f":"K19","v":1736.7403884458131},{"$f":"N19","v":1736.7403884458131},null,"Lampsilis","Mollusk","Author reported","Well water/deionized water mix"]
[]
[null,"Cladoceran, Ceriodaphnia dubia",50,7.15,1.1000000000000001,"Reproduction - young/starting adult",null,1779.6,"McCauley et al. 1986",null,{"$f":"EXP(LN(H21)-0.597*(LN(E21)-LN('Summary Sheet'!$C$6))-8.802*(D21-'Summary Sheet'!$C$4)-2.089*(LN(C21)-LN('Summary Sheet'!$C$5))+0.491*(D21^2-'Summary Sheet'!$C$4^2)+0.23*(D21*LN(C21)-'Summary Sheet'!$C$4*LN('Summary Sheet'!$C$5)))","v":3436.8437031824751},null,null,null,null,null,"Ceriodaphnia",null,"Value is from personal communication with R. Erickson who works at the Lab","Raw Lake Superior water"]
[null,"Cladoceran, Ceriodaphnia dubia",50.5,7.61,1.1000000000000001,"MATC: reproduction - young/starting adult)","<",1100,"McCauley et al. 1986","<",{"$f":"EXP(LN(H22)-0.597*(LN(E22)-LN('Summary Sheet'!$C$6))-8.802*(D22-'Summary Sheet'!$C$4)-2.089*(LN(C22)-LN('Summary Sheet'!$C$5))+0.491*(D22^2-'Summary Sheet'!$C$4^2)+0.23*(D22*LN(C22)-'Summary Sheet'!$C$4*LN('Summary Sheet'!$C$5)))","v":1566.3851913696246},"f",null,null,null,null,"Ceriodaphnia",null,"Value is from personal communication with R. Erickson who works at the Lab","UW-S Lake Superior lab water"]
[null,"Cladoceran, Ceriodaphnia dubia",25,7.65,0.5,"Reproduction - young/female",null,1557,"ENSR 1992b",null,{"$f":"EXP(LN(H23)-0.597*(LN(E23)-LN('Summary Sheet'!$C$6))-8.802*(D23-'Summary Sheet'!$C$4)-2.089*(LN(C23)-LN('Summary Sheet'!$C$5))+0.491*(D23^2-'Summary Sheet'!$C$4^2)+0.23*(D23*LN(C23)-'Summary Sheet'!$C$4*LN('Summary Sheet'!$C$5)))","v":4403.102828593177},null,null,null,null,null,"Ceriodaphnia",null,"Value is from 2007 FW Cu AWQC Appendix C recommendation","Very Soft Lab Recon water"]
[null,"Cladoceran, Ceriodaphnia dubia",47,7.7,0.5,"Reproduction - young/female",null,808.73,"ENSR 1992b",null,{"$f":"EXP(LN(H24)-0.597*(LN(E24)-LN('Summary Sheet'!$C$6))-8.802*(D24-'Summary Sheet'!$C$4)-2.089*(LN(C24)-LN('Summary Sheet'!$C$5))+0.491*(D24^2-'Summary Sheet'!$C$4^2)+0.23*(D24*LN(C24)-'Summary Sheet'!$C$4*LN('Summary Sheet'!$C$5)))","v":1822.6173489330806},null,null,null,null,null,"Ceriodaphnia",null,"Value is from 2007 FW Cu AWQC Appendix C recommendation","Soft Lab Recon water"]
[null,"Cladoceran, Ceriodaphnia dubia",94,8.1999999999999993,0.5,"Reproduction - young/female",null,651.9,"ENSR 1992b",null,{"$f":"EXP(LN(H25)-0.597*(LN(E25)-LN('Summary Sheet'!$C$6))-8.802*(D25-'Summary Sheet'!$C$4)-2.089*(LN(C25)-LN('Summary Sheet'!$C$5))+0.491*(D25^2-'Summary Sheet'!$C$4^2)+0.23*(D25*LN(C25)-'Summary Sheet'!$C$4*LN('Summary Sheet'!$C$5)))","v":1208.2919228448168},null,null,null,null,null,"Ceriodaphnia",null,"Value is from 2007 FW Cu AWQC Appendix C recommendation","Mod Hard Lab Recon water"]
[null,"Cladoceran, Ceriodaphnia dubia",196,8.4499999999999993,0.5,"Reproduction - young/female",null,683.62,"ENSR 1992b",null,{"$f":"EXP(LN(H26)-0.597*(LN(E26)-LN('Summary Sheet'!$C$6))-8.802*(D26-'Summary Sheet'!$C$4)-2.089*(LN(C26)-LN('Summary Sheet'!$C$5))+0.491*(D26^2-'Summary Sheet'!$C$4^2)+0.23*(D26*LN(C26)-'Summary Sheet'!$C$4*LN('Summary Sheet'!$C$5)))","v":1264.0608279478772},null,null,null,null,null,"Ceriodaphnia",null,"Value is from 2007 FW Cu AWQC Appendix C recommendation","Hard Lab Recon water"]
[null,"Cladoceran, Ceriodaphnia dubia",25,6.34,0.5,"Reproduction",null,36.6,"European Al Association 2010; Gensemer et al. 2018",null,{"$f":"EXP(LN(H27)-0.597*(LN(E27)-LN('Summary Sheet'!$C$6))-8.802*(D27-'Summary Sheet'!$C$4)-2.089*(LN(C27)-LN('Summary Sheet'!$C$5))+0.491*(D27^2-'Summary Sheet'!$C$4^2)+0.23*(D27*LN(C27)-'Summary Sheet'!$C$4*LN('Summary Sheet'!$C$5)))","v":493.66721791264018},null,null,null,null,null,"Ceriodaphnia",null,"Value is from 2007 FW Cu AWQC Appendix C recommendation","Lab Recon water (between very soft and soft)"]
[null,"Cladoceran, Ceriodaphnia dubia",60,6.4,0.5,"Reproduction",null,160.30000000000001,"European Al Association 2010; Gensemer et al. 2018",null,{"$f":"EXP(LN(H28)-0.597*(LN(E28)-LN('Summary Sheet'!$C$6))-8.802*(D28-'Summary Sheet'!$C$4)-2.089*(LN(C28)-LN('Summary Sheet'!$C$5))+0.491*(D28^2-'Summary Sheet'!$C$4^2)+0.23*(D28*LN(C28)-'Summary Sheet'!$C$4*LN('Summary Sheet'!$C$5)))","v":1130.3890414002237},null,null,null,null,null,"Ceriodaphnia",null,"Value is from 2007 FW Cu AWQC Appendix C recommendation","Lab Recon water (between soft and mod hard)"]
[null,"Cladoceran, Ceriodaphnia dubia",120,6.38,0.5,"Reproduction",null,221.6,"European Al Association 2010; Gensemer et al. 2018",null,{"$f":"EXP(LN(H29)-0.597*(LN(E29)-LN('Summary Sheet'!$C$6))-8.802*(D29-'Summary Sheet'!$C$4)-2.089*(LN(C29)-LN('Summary Sheet'!$C$5))+0.491*(D29^2-'Summary Sheet'!$C$4^2)+0.23*(D29*LN(C29)-'Summary Sheet'!$C$4*LN('Summary Sheet'!$C$5)))","v":1048.3682216588288},null,null,null,null,null,"Ceriodaphnia",null,"Value is from 2007 FW Cu AWQC Appendix C recommendation","Lab Recon water (between mod hard and hard)"]
[null,"Cladoceran, Ceriodaphnia dubia",25,6.34,2,"Reproduction",null,377.4,"European Al Association 2010; Gensemer et al. 2018",null,{"$f":"EXP(LN(H30)-0.597*(LN(E30)-LN('Summary Sheet'!$C$6))-8.802*(D30-'Summary Sheet'!$C$4)-2.089*(LN(C30)-LN('Summary Sheet'!$C$5))+0.491*(D30^2-'Summary Sheet'!$C$4^2)+0.23*(D30*LN(C30)-'Summary Sheet'!$C$4*LN('Summary Sheet'!$C$5)))","v":2224.975762257573},null,null,null,null,null,"Ceriodaphnia",null,"Author reported","Lab Recon water (between very soft and soft)"]
[null,"Cladoceran, Ceriodaphnia dubia",60,6.38,2,"Reproduction",null,631.29999999999995,"European Al Association 2010; Gensemer et al. 2018",null,{"$f":"EXP(LN(H31)-0.597*(LN(E31)-LN('Summary Sheet'!$C$6))-8.802*(D31-'Summary Sheet'!$C$4)-2.089*(LN(C31)-LN('Summary Sheet'!$C$5))+0.491*(D31^2-'Summary Sheet'!$C$4^2)+0.23*(D31*LN(C31)-'Summary Sheet'!$C$4*LN('Summary Sheet'!$C$5)))","v":2008.4929507056422},null,null,null,null,null,"Ceriodaphnia",null,"Author reported","Lab Recon water (between soft and mod hard)"]
[null,"Cladoceran, Ceriodaphnia dubia",120,6.37,2,"Reproduction",null,1011.6,"European Al Association 2010; Gensemer et al. 2018",null,{"$f":"EXP(LN(H32)-0.597*(LN(E32)-LN('Summary Sheet'!$C$6))-8.802*(D32-'Summary Sheet'!$C$4)-2.089*(LN(C32)-LN('Summary Sheet'!$C$5))+0.491*(D32^2-'Summary Sheet'!$C$4^2)+0.23*(D32*LN(C32)-'Summary Sheet'!$C$4*LN('Summary Sheet'!$C$5)))","v":2122.1675085191946},null,null,null,null,null,"Ceriodaphnia",null,"Author reported","Lab Recon water (between mod hard and hard)"]
[null,"Cladoceran, Ceriodaphnia dubia",25,6.33,4,"Reproduction",null,622.6,"European Al Association 2010; Gensemer et al. 2018",null,{"$f":"EXP(LN(H33)-0.597*(LN(E33)-LN('Summary Sheet'!$C$6))-8.802*(D33-'Summary Sheet'!$C$4)-2.089*(LN(C33)-LN('Summary Sheet'!$C$5))+0.491*(D33^2-'Summary Sheet'!$C$4^2)+0.23*(D33*LN(C33)-'Summary Sheet'!$C$4*LN('Summary Sheet'!$C$5)))","v":2471.7902015559489},null,null,null,null,null,"Ceriodaphnia",null,"Author reported","Lab Recon water (between very soft and soft)"]
[null,"Cladoceran, Ceriodaphnia dubia",60,6.3,4,"Reproduction",null,692.9,"European Al Association 2010; Gensemer et al. 2018",null,{"$f":"EXP(LN(H34)-0.597*(LN(E34)-LN('Summary Sheet'!$C$6))-8.802*(D34-'Summary Sheet'!$C$4)-2.089*(LN(C34)-LN('Summary Sheet'!$C$5))+0.491*(D34^2-'Summary Sheet'!$C$4^2)+0.23*(D34*LN(C34)-'Summary Sheet'!$C$4*LN('Summary Sheet'!$C$5)))","v":1661.0234717064134},null,null,null,null,null,"Ceriodaphnia",null,"Author reported","Lab Recon water (between soft and mod hard)"]
[null,"Cladoceran, Ceriodaphnia dubia",120,6.38,4,"Reproduction",null,840.5,"European Al Association 2010; Gensemer et al. 2018",null,{"$f":"EXP(LN(H35)-0.597*(LN(E35)-LN('Summary Sheet'!$C$6))-8.802*(D35-'Summary Sheet'!$C$4)-2.089*(LN(C35)-LN('Summary Sheet'!$C$5))+0.491*(D35^2-'Summary Sheet'!$C$4^2)+0.23*(D35*LN(C35)-'Summary Sheet'!$C$4*LN('Summary Sheet'!$C$5)))","v":1149.0451329840275},null,null,null,null,null,"Ceriodaphnia",null,"Author reported","Lab Recon water (between mod hard and hard)"]
[null,"Cladoceran, Ceriodaphnia dubia",25,6.37,2,"Reproduction",null,353,"Gensemer et al. 2018",null,{"$f":"EXP(LN(H36)-0.597*(LN(E36)-LN('Summary Sheet'!$C$6))-8.802*(D36-'Summary Sheet'!$C$4)-2.089*(LN(C36)-LN('Summary Sheet'!$C$5))+0.491*(D36^2-'Summary Sheet'!$C$4^2)+0.23*(D36*LN(C36)-'Summary Sheet'!$C$4*LN('Summary Sheet'!$C$5)))","v":1970.4796482470974},null,null,null,null,null,"Ceriodaphnia",null,"Author reported","Lab Recon water (between very soft and soft)"]
[null,"Cladoceran, Ceriodaphnia dubia",25,6.34,2,"Reproduction",null,452.4,"Gensemer et al. 2018",null,{"$f":"EXP(LN(H37)-0.597*(LN(E37)-LN('Summary Sheet'!$C$6))-8.802*(D37-'Summary Sheet'!$C$4)-2.089*(LN(C37)-LN('Summary Sheet'!$C$5))+0.491*(D37^2-'Summary Sheet'!$C$4^2)+0.23*(D37*LN(C37)-'Summary Sheet'!$C$4*LN('Summary Sheet'!$C$5)))","v":2667.141056823858},null,null,null,null,null,"Ceriodaphnia",null,"Author reported","Lab Recon water (between very soft and soft)"]
[null,"Cladoceran, Ceriodaphnia dubia",25,6.35,2,"Reproduction",null,439.7,"Gensemer et al. 2018",null,{"$f":"EXP(LN(H38)-0.597*(LN(E38)-LN('Summary Sheet'!$C$6))-8.802*(D38-'Summary Sheet'!$C$4)-2.089*(LN(C38)-LN('Summary Sheet'!$C$5))+0.491*(D38^2-'Summary Sheet'!$C$4^2)+0.23*(D38*LN(C38)-'Summary Sheet'!$C$4*LN('Summary Sheet'!$C$5)))","v":2545.2385536186316},null,null,null,null,null,"Ceriodaphnia",null,"Author reported","Lab Recon water (between very soft and soft)"]
[null,"Cladoceran, Ceriodaphnia dubia",25,7.04,0.5,"Reproduction (young/female)",null,250,"CECM 2014; Gensemer et al. 2018",null,{"$f":"EXP(LN(H39)-0.597*(LN(E39)-LN('Summary Sheet'!$C$6))-8.802*(D39-'Summary Sheet'!$C$4)-2.089*(LN(C39)-LN('Summary Sheet'!$C$5))+0.491*(D39^2-'Summary Sheet'!$C$4^2)+0.23*(D39*LN(C39)-'Summary Sheet'!$C$4*LN('Summary Sheet'!$C$5)))","v":1186.5667444219241},null,null,null,null,null,"Ceriodaphnia",null,"Author reported","Lab Recon water (between very soft and soft)"]
[null,"Cladoceran, Ceriodaphnia dubia",120,7.14,0.5,"Reproduction (young/female)",null,860,"CECM 2014; Gensemer et al. 2018",null,{"$f":"EXP(LN(H40)-0.597*(LN(E40)-LN('Summary Sheet'!$C$6))-8.802*(D40-'Summary Sheet'!$C$4)-2.089*(LN(C40)-LN('Summary Sheet'!$C$5))+0.491*(D40^2-'Summary Sheet'!$C$4^2)+0.23*(D40*LN(C40)-'Summary Sheet'!$C$4*LN('Summary Sheet'!$C$5)))","v":1814.3913583848498},null,null,null,null,null,"Ceriodaphnia",null,"Author reported","Lab Recon water (between mod hard and hard)"]
[null,"Cladoceran, Ceriodaphnia dubia",25,7.98,0.5,"Reproduction (young/female)",null,700,"CECM 2014; Gensemer et al. 2018"," ",{"$f":"EXP(LN(H41)-0.597*(LN(E41)-LN('Summary Sheet'!$C$6))-8.802*(D41-'Summary Sheet'!$C$4)-2.089*(LN(C41)-LN('Summary Sheet'!$C$5))+0.491*(D41^2-'Summary Sheet'!$C$4^2)+0.23*(D41*LN(C41)-'Summary Sheet'!$C$4*LN('Summary Sheet'!$C$5)))","v":1742.0371757201112},null,null,null,null,null,"Ceriodaphnia",null,"Author reported","Lab Recon water (between very soft and soft)"]
[null,"Cladoceran, Ceriodaphnia dubia",60,8.0299999999999994,0.5,"Reproduction (young/female)",null,1010,"CECM 2014; Gensemer et al. 2018",null,{"$f":"EXP(LN(H42)-0.597*(LN(E42)-LN('Summary Sheet'!$C$6))-8.802*(D42-'Summary Sheet'!$C$4)-2.089*(LN(C42)-LN('Summary Sheet'!$C$5))+0.491*(D42^2-'Summary Sheet'!$C$4^2)+0.23*(D42*LN(C42)-'Summary Sheet'!$C$4*LN('Summary Sheet'!$C$5)))","v":2013.1327372403321},null,null,null,null,null,"Ceriodaphnia",null,"Author reported","Lab Recon water (between soft and mod hard)"]
[null,"Cladoceran, Ceriodaphnia dubia",120,8.1,0.5,"Reproduction (young/female)",null,870,"CECM 2014; Gensemer et al. 2018",null,{"$f":"EXP(LN(H43)-0.597*(LN(E43)-LN('Summary Sheet'!$C$6))-8.802*(D43-'Summary Sheet'!$C$4)-2.089*(LN(C43)-LN('Summary Sheet'!$C$5))+0.491*(D43^2-'Summary Sheet'!$C$4^2)+0.23*(D43*LN(C43)-'Summary Sheet'!$C$4*LN('Summary Sheet'!$C$5)))","v":1488.837286877008},null,null,null,null,null,"Ceriodaphnia",null,"Author reported","Lab Recon water (between mod hard and hard)"]
[null,"Cladoceran, Ceriodaphnia dubia",25,6.34,0.5,"Reproduction (young/female)",null,260,"CECM 2014; Gensemer et al. 2018",null,{"$f":"EXP(LN(H44)-0.597*(LN(E44)-LN('Summary Sheet'!$C$6))-8.802*(D44-'Summary Sheet'!$C$4)-2.089*(LN(C44)-LN('Summary Sheet'!$C$5))+0.491*(D44^2-'Summary Sheet'!$C$4^2)+0.23*(D44*LN(C44)-'Summary Sheet'!$C$4*LN('Summary Sheet'!$C$5)))","v":3506.9255917291457},null,null,null,null,null,"Ceriodaphnia",null,"Author reported","Lab Recon water (between very soft and soft)"]
[null,"Cladoceran, Ceriodaphnia dubia",120,6.36,0.5,"Reproduction (young/female)",null,390,"CECM 2014; Gensemer et al. 2018",null,{"$f":"EXP(LN(H45)-0.597*(LN(E45)-LN('Summary Sheet'!$C$6))-8.802*(D45-'Summary Sheet'!$C$4)-2.089*(LN(C45)-LN('Summary Sheet'!$C$5))+0.491*(D45^2-'Summary Sheet'!$C$4^2)+0.23*(D45*LN(C45)-'Summary Sheet'!$C$4*LN('Summary Sheet'!$C$5)))","v":1899.1727620451259},null,null,null,null,null,"Ceriodaphnia",null,"Author reported","Lab Recon water (between mod hard and hard)"]
[null,"Cladoceran, Ceriodaphnia dubia",64,6.42,1.87,"Reproduction (young/female)",null,828.6,"OSU 2018a",null,{"$f":"EXP(LN(H46)-0.597*(LN(E46)-LN('Summary Sheet'!$C$6))-8.802*(D46-'Summary Sheet'!$C$4)-2.089*(LN(C46)-LN('Summary Sheet'!$C$5))+0.491*(D46^2-'Summary Sheet'!$C$4^2)+0.23*(D46*LN(C46)-'Summary Sheet'!$C$4*LN('Summary Sheet'!$C$5)))","v":2476.685594622299},null,null,null,null,null,"Ceriodaphnia",null,"Author reported","Lab Recon water"]
[null,"Cladoceran, Ceriodaphnia dubia",133,6.3250000000000002,8.7100000000000009,"Reproduction (young/female)",null,3829,"OSU 2018a",null,{"$f":"EXP(LN(H47)-0.597*(LN(E47)-LN('Summary Sheet'!$C$6))-8.802*(D47-'Summary Sheet'!$C$4)-2.089*(LN(C47)-LN('Summary Sheet'!$C$5))+0.491*(D47^2-'Summary Sheet'!$C$4^2)+0.23*(D47*LN(C47)-'Summary Sheet'!$C$4*LN('Summary Sheet'!$C$5)))","v":3339.8762624603232},null,null,null,null,null,"Ceriodaphnia",null,"Author reported","Lab Recon water"]
[null,"Cladoceran, Ceriodaphnia dubia",138,6.3949999999999996,12.3,"Reproduction (young/female)",null,6224,"OSU 2018a",null,{"$f":"EXP(LN(H48)-0.597*(LN(E48)-LN('Summary Sheet'!$C$6))-8.802*(D48-'Summary Sheet'!$C$4)-2.089*(LN(C48)-LN('Summary Sheet'!$C$5))+0.491*(D48^2-'Summary Sheet'!$C$4^2)+0.23*(D48*LN(C48)-'Summary Sheet'!$C$4*LN('Summary Sheet'!$C$5)))","v":3906.610983920847},null,null,null,null,null,"Ceriodaphnia",null,"Author reported","Lab Recon water"]
[null,"Cladoceran, Ceriodaphnia dubia",428,6.2949999999999999,1.64,"Reproduction (young/female)",null,2011,"OSU 2018a",null,{"$f":"EXP(LN(H49)-0.597*(LN(E49)-LN('Summary Sheet'!$C$6))-8.802*(D49-'Summary Sheet'!$C$4)-2.089*(LN(C49)-LN('Summary Sheet'!$C$5))+0.491*(D49^2-'Summary Sheet'!$C$4^2)+0.23*(D49*LN(C49)-'Summary Sheet'!$C$4*LN('Summary Sheet'!$C$5)))","v":2348.7486522450549},null,null,null,null,null,"Ceriodaphnia",null,"Author reported","Lab Recon water"]
[null,"Cladoceran, Ceriodaphnia dubia",125,7.2050000000000001,6.57,"Reproduction (young/female)",null,6401,"OSU 2018a",null,{"$f":"EXP(LN(H50)-0.597*(LN(E50)-LN('Summary Sheet'!$C$6))-8.802*(D50-'Summary Sheet'!$C$4)-2.089*(LN(C50)-LN('Summary Sheet'!$C$5))+0.491*(D50^2-'Summary Sheet'!$C$4^2)+0.23*(D50*LN(C50)-'Summary Sheet'!$C$4*LN('Summary Sheet'!$C$5)))","v":2731.8861363207898},null,null,null,null,null,"Ceriodaphnia",null,"Author reported","Lab Recon water"]
[null,"Cladoceran, Ceriodaphnia dubia",127,7.1849999999999996,12.01,"Reproduction (young/female)",null,6612,"OSU 2018a",null,{"$f":"EXP(LN(H51)-0.597*(LN(E51)-LN('Summary Sheet'!$C$6))-8.802*(D51-'Summary Sheet'!$C$4)-2.089*(LN(C51)-LN('Summary Sheet'!$C$5))+0.491*(D51^2-'Summary Sheet'!$C$4^2)+0.23*(D51*LN(C51)-'Summary Sheet'!$C$4*LN('Summary Sheet'!$C$5)))","v":1979.591368154732},null,null,null,null,null,"Ceriodaphnia",null,"Author reported","Lab Recon water"]
[null,"Cladoceran, Ceriodaphnia dubia",263,8.17,1.3,"Reproduction (young/female)",null,3749,"OSU 2018a",null,{"$f":"EXP(LN(H52)-0.597*(LN(E52)-LN('Summary Sheet'!$C$6))-8.802*(D52-'Summary Sheet'!$C$4)-2.089*(LN(C52)-LN('Summary Sheet'!$C$5))+0.491*(D52^2-'Summary Sheet'!$C$4^2)+0.23*(D52*LN(C52)-'Summary Sheet'!$C$4*LN('Summary Sheet'!$C$5)))","v":3138.4976997861536},null,null,null,null,null,"Ceriodaphnia",null,"Author reported","Lab Recon water"]
[null,"Cladoceran, Ceriodaphnia dubia",425,8.2100000000000009,1.2,"Reproduction (young/female)",null,2852,"OSU 2018a",null,{"$f":"EXP(LN(H53)-0.597*(LN(E53)-LN('Summary Sheet'!$C$6))-8.802*(D53-'Summary Sheet'!$C$4)-2.089*(LN(C53)-LN('Summary Sheet'!$C$5))+0.491*(D53^2-'Summary Sheet'!$C$4^2)+0.23*(D53*LN(C53)-'Summary Sheet'!$C$4*LN('Summary Sheet'!$C$5)))","v":2322.455758183833},null,null,null,null,null,"Ceriodaphnia",null,"Author reported","Lab Recon water"]
[null,"Cladoceran, Ceriodaphnia dubia",125,8.6999999999999993,1.04,"Reproduction (young/female)",null,1692.5,"OSU 2018a",null,{"$f":"EXP(LN(H54)-0.597*(LN(E54)-LN('Summary Sheet'!$C$6))-8.802*(D54-'Summary Sheet'!$C$4)-2.089*(LN(C54)-LN('Summary Sheet'!$C$5))+0.491*(D54^2-'Summary Sheet'!$C$4^2)+0.23*(D54*LN(C54)-'Summary Sheet'!$C$4*LN('Summary Sheet'!$C$5)))","v":2589.337771994572},null,null,{"$f":"GEOMEAN(K21, K23:K54)","v":1999.7504489656797},{"$f":"N54","v":1999.7504489656797},null,"Ceriodaphnia","Invert","Author reported","Lab Recon water"]
[]
[null,"Cladoceran, Daphnia magna",140,6.3,2,"Reproduction (young/female)",null,791,"European Al Association 2010; Gensemer et al. 2018",null,{"$f":"EXP(LN(H56)-0.597*(LN(E56)-LN('Summary Sheet'!$C$6))-8.802*(D56-'Summary Sheet'!$C$4)-2.089*(LN(C56)-LN('Summary Sheet'!$C$5))+0.491*(D56^2-'Summary Sheet'!$C$4^2)+0.23*(D56*LN(C56)-'Summary Sheet'!$C$4*LN('Summary Sheet'!$C$5)))","v":1667.5983488385039},null,null,{"$f":"GEOMEAN(K56)","v":1667.5983488385039},{"$f":"N56","v":1667.5983488385039},null,"Daphnia","Invert","Author reported","Hard Lab Recon water"]
[]
[null,"Amphipod, Hyalella azteca",95,6.35,0.51,"Biomass (28 d)",null,199.3,"OSU 2012h; Cardwell et al. 2018",null,{"$f":"EXP(LN(H58)-0.597*(LN(E58)-LN('Summary Sheet'!$C$6))-8.802*(D58-'Summary Sheet'!$C$4)-2.089*(LN(C58)-LN('Summary Sheet'!$C$5))+0.491*(D58^2-'Summary Sheet'!$C$4^2)+0.23*(D58*LN(C58)-'Summary Sheet'!$C$4*LN('Summary Sheet'!$C$5)))","v":1127.1477486401163},null,null,null,null,null,"Hyalella",null,"Author reported","Well water/reverse osmosis water mix"]
[null,"Amphipod, Hyalella azteca",106,6.04,{"$f":"AVERAGE(0.26,0.39)","v":0.32500000000000001},"Biomass (28 d)",null,425,"Wang et al. 2016, 2018",null,{"$f":"EXP(LN(H59)-0.597*(LN(E59)-LN('Summary Sheet'!$C$6))-8.802*(D59-'Summary Sheet'!$C$4)-2.089*(LN(C59)-LN('Summary Sheet'!$C$5))+0.491*(D59^2-'Summary Sheet'!$C$4^2)+0.23*(D59*LN(C59)-'Summary Sheet'!$C$4*LN('Summary Sheet'!$C$5)))","v":4890.7363987706358},null,null,{"$f":"GEOMEAN(K58:K59)","v":2347.888949900866},{"$f":"N59","v":2347.888949900866},null,"Hyalella","Invert","Author reported","Well water/deionized water mix"]
[]
[null,"Midge, Chironomus riparius",11.8,5.58,1.8,"Adult midge emergence",null,29.547000000000001,"Palawski et al. 1989",null,{"$f":"EXP(LN(H61)-0.597*(LN(E61)-LN('Summary Sheet'!$C$6))-8.802*(D61-'Summary Sheet'!$C$4)-2.089*(LN(C61)-LN('Summary Sheet'!$C$5))+0.491*(D61^2-'Summary Sheet'!$C$4^2)+0.23*(D61*LN(C61)-'Summary Sheet'!$C$4*LN('Summary Sheet'!$C$5)))","v":1820.1911457908543},null,null,null,null,null,"Chironomus",null,"Based on Cleveland et al. 1989 reported values at a similar pH","Well water/reverse osmosis water mix"]
[null,"Midge, Chironomus riparius",11.9,5.05,1.8,"Adult midge emergence",null,84.415999999999997,"Palawski et al. 1989",null,{"$f":"EXP(LN(H62)-0.597*(LN(E62)-LN('Summary Sheet'!$C$6))-8.802*(D62-'Summary Sheet'!$C$4)-2.089*(LN(C62)-LN('Summary Sheet'!$C$5))+0.491*(D62^2-'Summary Sheet'!$C$4^2)+0.23*(D62*LN(C62)-'Summary Sheet'!$C$4*LN('Summary Sheet'!$C$5)))","v":25504.195764601835},null,null,null,null,null,"Chironomus",null,"Based on Cleveland et al. 1989 reported values at a similar pH","Well water/reverse osmosis water mix"]
[null,"Midge, Chironomus riparius",91,6.6,0.51,"Reproduction (# of eggs/case)",null,3387,"OSU 2012f; Cardwell et al. 2018",null,{"$f":"EXP(LN(H63)-0.597*(LN(E63)-LN('Summary Sheet'!$C$6))-8.802*(D63-'Summary Sheet'!$C$4)-2.089*(LN(C63)-LN('Summary Sheet'!$C$5))+0.491*(D63^2-'Summary Sheet'!$C$4^2)+0.23*(D63*LN(C63)-'Summary Sheet'!$C$4*LN('Summary Sheet'!$C$5)))","v":13847.466604691706},null,null,{"$f":"GEOMEAN(K61:K63)","v":8630.4409557603212},{"$f":"N63","v":8630.4409557603212},null,"Chironomus","Invert","Author reported","Well water/reverse osmosis water mix"]
[]
[null,"Atlantic salmon, Salmo salar",12.7,5.7,1.8,"Biomass",null,61.564,"McKee et al. 1989",null,{"$f":"EXP(LN(H65)-2.209*(LN(E65)-LN('Summary Sheet'!$C$6))-2.041*(D65-'Summary Sheet'!$C$4)-1.862*(LN(C65)-LN('Summary Sheet'!$C$5))+0.232*(D65*LN(C65)-'Summary Sheet'!$C$4*LN('Summary Sheet'!$C$5))+0.261*(D65*LN(E65)-'Summary Sheet'!$C$4*LN('Summary Sheet'!$C$6)))","v":564.22807385207557},null,null,null,null,null,"Salmo",null,"Based on Cleveland et al. 1989 reported values at a similar pH","Well water/reverse osmosis water mix"]
[null,"Atlantic salmon, Salmo salar",12.7,5.7,1.8,"Survival",null,154.22,"Buckler et al. 1995",null,{"$f":"EXP(LN(H66)-2.209*(LN(E66)-LN('Summary Sheet'!$C$6))-2.041*(D66-'Summary Sheet'!$C$4)-1.862*(LN(C66)-LN('Summary Sheet'!$C$5))+0.232*(D66*LN(C66)-'Summary Sheet'!$C$4*LN('Summary Sheet'!$C$5))+0.261*(D66*LN(E66)-'Summary Sheet'!$C$4*LN('Summary Sheet'!$C$6)))","v":1413.411304487478},"d",null,{"$f":"GEOMEAN(K65)","v":564.22807385207557},{"$f":"N66","v":564.22807385207557},null,"Salmo","Fish","Based on Cleveland et al. 1989 reported values at a similar pH","Well water/reverse osmosis water mix"]
[]
[null,"Brook trout, Salvelinus fontinalis",12.3,6.55,1.9,"Biomass",null,164.35,"Cleveland et al. 1989",null,{"$f":"EXP(LN(H68)-2.209*(LN(E68)-LN('Summary Sheet'!$C$6))-2.041*(D68-'Summary Sheet'!$C$4)-1.862*(LN(C68)-LN('Summary Sheet'!$C$5))+0.232*(D68*LN(C68)-'Summary Sheet'!$C$4*LN('Summary Sheet'!$C$5))+0.261*(D68*LN(E68)-'Summary Sheet'!$C$4*LN('Summary Sheet'!$C$6)))","v":491.80771562014525},null,null,null,null,null,"Salvelinus",null,"Author reported","Well water/reverse osmosis water mix"]
[null,"Brook trout, Salvelinus fontinalis",12.8,5.65,1.8,"Biomass",null,143.47,"Cleveland et al. 1989",null,{"$f":"EXP(LN(H69)-2.209*(LN(E69)-LN('Summary Sheet'!$C$6))-2.041*(D69-'Summary Sheet'!$C$4)-1.862*(LN(C69)-LN('Summary Sheet'!$C$5))+0.232*(D69*LN(C69)-'Summary Sheet'!$C$4*LN('Summary Sheet'!$C$5))+0.261*(D69*LN(E69)-'Summary Sheet'!$C$4*LN('Summary Sheet'!$C$6)))","v":1396.9979160078963},null,null,{"$f":"GEOMEAN(K68:K69)","v":828.88741925423574},{"$f":"N69","v":828.88741925423574},null,"Salvelinus","Fish","Author reported","Well water/reverse osmosis water mix"]
[]
[null,"Fathead minnow, Pimephales promelas",220,7.7,1.6,"Biomass",null,6193.6,"Kimball 1978",null,{"$f":"EXP(LN(H71)-2.209*(LN(E71)-LN('Summary Sheet'!$C$6))-2.041*(D71-'Summary Sheet'!$C$4)-1.862*(LN(C71)-LN('Summary Sheet'!$C$5))+0.232*(D71*LN(C71)-'Summary Sheet'!$C$4*LN('Summary Sheet'!$C$5))+0.261*(D71*LN(E71)-'Summary Sheet'!$C$4*LN('Summary Sheet'!$C$6)))","v":3493.439440653985},null,null,null,null,null,"Pimephales",null,"Value is from 2007 FW Cu AWQC Appendix C recommendation","Well water"]
[null,"Fathead minnow, Pimephales promelas",96,6.2,0.25,"Fry survival",null,428.6,"OSU 2012g; Cardwell et al. 2018",null,{"$f":"EXP(LN(H72)-2.209*(LN(E72)-LN('Summary Sheet'!$C$6))-2.041*(D72-'Summary Sheet'!$C$4)-1.862*(LN(C72)-LN('Summary Sheet'!$C$5))+0.232*(D72*LN(C72)-'Summary Sheet'!$C$4*LN('Summary Sheet'!$C$5))+0.261*(D72*LN(E72)-'Summary Sheet'!$C$4*LN('Summary Sheet'!$C$6)))","v":2797.241764806522},null,null,{"$f":"GEOMEAN(K71:K72)","v":3126.0189868616699},{"$f":"N72","v":3126.0189868616699},null,"Pimephales","Fish","Author reported; half the detection limit","Well water/reverse osmosis water mix"]
[]
[null,"Zebrafish, Danio rerio",83,6.15,0.25,"Biomass",null,234.4,"OSU 2013; Cardwell et al. 2018",null,{"$f":"EXP(LN(H74)-2.209*(LN(E74)-LN('Summary Sheet'!$C$6))-2.041*(D74-'Summary Sheet'!$C$4)-1.862*(LN(C74)-LN('Summary Sheet'!$C$5))+0.232*(D74*LN(C74)-'Summary Sheet'!$C$4*LN('Summary Sheet'!$C$5))+0.261*(D74*LN(E74)-'Summary Sheet'!$C$4*LN('Summary Sheet'!$C$6)))","v":1743.0883001766804},null,null,{"$f":"K74","v":1743.0883001766804},{"$f":"N74","v":1743.0883001766804},null,"Danio","Fish","Author reported; half the detection limit","Well water/reverse osmosis water mix"]
[]
[null,"Wood frog, Rana sylvatica",115,4.6900000000000004,1.6,"MATC-survival",">",2000,"Peles 2013",">",{"$f":"EXP(LN(H76)-2.209*(LN(E76)-LN('Summary Sheet'!$C$6))-2.041*(D76-'Summary Sheet'!$C$4)-1.862*(LN(C76)-LN('Summary Sheet'!$C$5))+0.232*(D76*LN(C76)-'Summary Sheet'!$C$4*LN('Summary Sheet'!$C$5))+0.261*(D76*LN(E76)-'Summary Sheet'!$C$4*LN('Summary Sheet'!$C$6)))","v":13877.214663251772},null,">",{"$f":"K76","v":13877.214663251772},{"$f":"N76","v":13877.214663251772},">","Rana","Amphib - Other Data","Value is from 2007 FW Cu AWQC Appendix C recommendation","Aged aerated tap water (McKeesport, PA)"]
[null,"a LC=Life cycle, ELS=Early life-stage."]
[null,"b Normalized to pH 7, hardness of 100 mg/L as CaCO3 and DOC of 1 mg/L (see Section 2.7.1). Values in bold are used in SMCV calculation."]
[null,"c When definitive DOC values were not reported by the authors: a DOC value of 0.5 mg/L was used when dilution water was reconstituted, 1.1 mg/L when dilution water was Lake Superior water, 1.6 mg/L when dilution water was tap or well water, or half the detection limit when the reported value was less than the detection limit, based on recommendations in the 2007 Freshwater Copper AWQC (U.S. EPA 2007b)."]
[null,"d Buckler et al. (1995) appears to be a republication of McKee et al. (1989), but does not report the most sensitive endpoint and therefore only the most sensitive endpoint used for calculation of the SMCV."]
[null,"e DOC was taken from reported values in Cleveland et al. (1989) for a similar pH; all studies are from the same lab and used the same procedures to make the dilution water (well water plus reverse osmosis water mixture)."]
[null,"f Value is an MATC, poor dose response prevented an EC20 from being calculated; not used in SMCV calculation."]