{"text_format":"1","workbook":"xlsx","n_sheets":11,"sheets":["Stream Rest. Credit Calculator","Min Qualifying Conditions","lookup","P3 Curve Eqns","Protocol 1","Protocol 2","Protocol 2 Revised","Protocol 3","Protocol 3 Revised","Protocol 4","Protocol 5"],"not_rendered":{"charts":3,"images":1,"macros":1,"external_links":1,"defined_names":30,"comments":0,"pivot_tables":0},"unopened":[],"bounds":{"document_bytes":16777216,"sheet_cells":100000,"rows_first":2000,"rows_last":500,"rows_between":2000,"halvings":0,"cell_chars":16384,"cell_head_chars":4096},"cells_cut":0,"cells_raw":0,"read":"whole","date_system":"1900"}

{"sheet":"Stream Rest. Credit Calculator","index":0,"n_rows":56,"n_cols":8,"rows_kept":56,"cut":false,"hidden":false,"merged":[[20,0,20,9],[24,1,26,9],[24,0,26,0],[22,1,23,9],[21,1,21,9],[22,0,23,0],[0,1,0,4],[34,1,34,3],[29,0,29,10],[33,1,33,3],[48,0,49,0],[37,0,37,10],[44,0,44,10],[46,0,46,1],[42,2,42,3],[41,2,41,3],[40,2,40,3],[48,4,48,6],[48,1,48,3],[12,0,13,9],[9,0,9,9],[8,0,8,9],[15,0,15,9],[45,0,45,9],[17,0,18,9],[16,0,16,9],[14,0,14,9],[10,0,11,9],[32,1,32,3],[31,1,31,3],[42,0,42,1],[41,0,41,1],[40,0,40,1],[38,0,39,9],[35,1,35,3]]}
[null,"Stream Restoration MS4 Credit Calculator for TN, TP, TSS, and EIA"]
[null,"Version: 05/23/2022"]
[null,"Maryland Department of the Environment - Water and Sciences Administration"]
[]
[]
[]
[]
[]
["About the Calculator"]
["1. This calculator estimates the pollutant load reductions and Equivalent Impervious Acre (EIA) credit for stream restoration projects."]
["2. The Minimum Qualifying Conditions tab outlines conditions that projects must meet to be eligible for credit. This criteria is found in the expert panel approved by CBP: http://chesapeakestormwater.net/bmp-resources/urban-stream-restoration/"]
[]
["3. The lookup tab in this spreadsheet draws Aggregate Impervious and Turf loading rate information from a CAST 2010 No Action Scenario consistent with the 2020 MS4 Accounting Guidance document and Stream Bed and Bank loading rate information from a CAST 2019 Progress Scenario."]
[]
["4. EOS load in this spreadsheet is calculated following the protocols recommended by the expert panel approved by CBP."]
{"$rows_left_out":42}
{"sheet":"Min Qualifying Conditions","index":1,"n_rows":38,"n_cols":1,"rows_kept":38,"cut":false,"hidden":false,"merged":[[18,0,18,17],[33,0,34,17],[10,0,11,17],[17,0,17,17],[16,0,16,17],[15,0,15,17],[14,0,14,17],[13,0,13,17],[12,0,12,17],[2,0,4,17],[5,0,5,17],[6,0,6,17],[9,0,9,17],[8,0,8,17],[7,0,7,17]]}
["Minimum Qualifying Conditions*"]
["In order for a project to qualify for EIA credits, it must meet the key criteria identified below, as well as all other criteria outlined within the expert panel report. "]
["1.     Stream restoration projects that are primarily designed to protect public infrastructure by bank armoring or rip rap do not qualify for a credit.  For further information regarding what does and does not constitute bank armoring, and specifically what is eligible for credit, please see the recently approved memo, Consensus Recommendations for Improving the Application of the prevented Sediment Protocol for Urban Stream Restoration Projects Built for Pollutant Removal Credit, specifically Table 3 of the report."]
[]
[]
["2.     The stream reach must be greater than 100 feet in length and be still actively enlarging or degrading in response to upstream development or adjustment to previous disturbances in the watershed (e.g., a road crossing and failing dams)."]
["3.     In addition, there may be certain project design conditions that must be satisfied in order to be eligible for credit under one or more of the specific protocols described in the stream restoration expert panel report."]
["o   Protocol 3:"]
["§  Maximum ponded volume in the flood plain that receives credit should be 1.0 foot to ensure interaction between runoff and wetland plants."]
["§  Minimum watershed to floodplain surface area ratio of one percent (credit is discounted proportionately for projects that cannot meet the 1% minimum)."]
["4.     A qualifying project must meet certain presumptive criteria to ensure that high functioning portions of the urban stream corridor are not used for in-stream stormwater treatment (i.e., where existing stream quality is still good). These may include one or more of the following:"]
[]
["o   Geomorphic evidence of active stream degradation (i.e., BEHI score)"]
["o   An IBI of fair or worse"]
["o   Hydrologic evidence of floodplain disconnection"]
{"$rows_left_out":24}
{"sheet":"lookup","index":2,"n_rows":508,"n_cols":20,"rows_kept":508,"cut":false,"hidden":false,"merged":[[0,0,1,0],[0,10,1,10],[0,14,0,16],[0,1,1,1],[0,2,1,2],[0,3,0,5],[0,6,0,8],[0,11,0,13]]}
["Helper","County","MD 8digit","Aggregate Impervious Load (lbs/yr)",null,null,"Turf Load (lbs/yr)",null,null,null,"Land River Segment","Stream Bed and Bank Load (lbs/mile)",null,null,"Delivery Factor",null,null,null,"Segment-shed","Segmented-shed Name"]
[null,null,null,"TN","TP","TSS","TN","TP","TSS",null,null,"TN","TP","TSS","TN","TP","TSS",null,"ANATF_DC","Anacostia River Tidal Fresh DC"]
[{"$f":"CONCATENATE(B3&C3)","v":"ALLEGANY02140508"},"ALLEGANY","02140508",33.9313174818598,6.965110849909939,34776.575395761072,14.379818329131062,3.2648565814108599,7173.2297033134892,null,"H24021PM1_3510_4000",334.37242481309403,82.223170892332803,343348.71244817501,0.65077390713734895,0.56774382506510301,0.50744597781948397,null,"ANATF_MD","Anacostia River Tidal Fresh Maryland"]
[{"$f":"CONCATENATE(B4&C4)","v":"ALLEGANY02140510"},"ALLEGANY","02140510",20.586566014868808,2.064746835416416,9884.0733080180198,10.038115606605759,1.332016097827091,1548.4291077295452,null,"H24021PM3_3040_3340",340.03318477563403,85.143207228675493,455490.80902688298,0.54619788030776195,0.50177516320425697,0.48634368742231199,null,"BACOH","Back River Oligohaline"]
["ALLEGANY02140511","ALLEGANY","02140511",25.560161516545989,3.2362180628309973,16601.398116720578,12.208269586842341,1.8423817729690302,3441.6456362588401,null,"H24021PM4_3340_3341",346.53225036075401,93.782955810873602,327886.63304812397,0.55254061361019402,0.35618546639917398,0.31422272029807702,null,"BIGMH","Big Annemessex River Mesohaline"]
["ALLEGANY02140512","ALLEGANY","02140512",35.617155219707797,5.6956542120039906,35072.627297664047,12.25868831414264,2.1003636911235413,4878.5384795383397,null,"H24023PU2_4720_4750",347.68420559114497,89.029761344311197,344798.05253424199,0.80242019714259505,0.56433760374074105,7.7740291753467694E-2,null,"BOHOH","Bohemia River Oligohaline"]
["ALLEGANY02141001","ALLEGANY","02141001",50.849666529177,9.2419312359234951,40838.866746337575,24.679744408960602,3.7349347652517997,8285.0771149510329,null,"H24023PU3_4451_4450",346.36102092474601,86.861161470058093,312720.09969083598,0.77126004453115904,0.60894863598035598,7.5650095895906197E-2,null,"BSHOH","Bush River Oligohaline"]
["ALLEGANY02141002","ALLEGANY","02141002",22.47472881701831,1.9978622374484418,12317.83479798515,11.951225696245618,1.2399492360144739,2499.5480540827002,null,"N24001PU0_3871_3690",365.99536339863198,100.22755726663399,319646.95154368703,0.59253057688796196,0.18479260194634201,0.136188417476307,null,"C&DOH_DE","C&D Canal Oligohaline Delaware"]
["ALLEGANY02141003","ALLEGANY","02141003",27.719963860290299,3.1675438396248019,18909.180451743989,13.968024447363499,1.5730860498078489,3720.9347007894403,null,"N24001PU1_3100_3690",337.42279680731002,77.080891486678894,307895.82992217399,0.62960597665005102,0.45753011572475,0.29896191214990098,null,"C&DOH_MD","C&D Canal Oligohaline Maryland"]
["ALLEGANY02141004","ALLEGANY","02141004",25.761518155447469,2.5857465924332872,14910.93221558824,13.567016752757841,1.299206631339936,3073.02454942534,null,"N24001PU1_3580_3780",344.76697011562101,87.551763203280501,366056.94783091999,0.64377502666389397,0.47109555940743902,0.46682483037642097,null,"CB1TF","Northern Chesapeake Bay Tidal Fresh"]
["ALLEGANY02141005","ALLEGANY","02141005",18.482342432043339,0.59927762861362499,15245.669460227939,12.970318269800194,0.83077894420408993,4348.9241349188396,null,"N24001PU1_3850_4190",0,0,0,0.81424401246105005,0.63800238594021497,0.111991393923419,null,"CB2OH","Northern Chesapeake Bay Oligohaline"]
["ALLEGANY02141006","ALLEGANY","02141006",17.487710097602001,0.54924605302642004,883.44402985443799,12.862084640462401,0.91183098293402898,286.19224330221601,null,"N24001PU1_3940_3970",318.43487889130398,62.844810158725402,361246.78886094299,0.54540320857957703,0.51932853506811105,0.55357161851969805,null,"CB3MH","Upper Chesapeake Bay Mesohaline"]
["ANNE ARUNDEL02130902","ANNE ARUNDEL","02130902",21.40825560206126,0.788563852483818,8772.6905395850936,12.910584074488272,0.80343603897441007,2260.618118729913,null,"N24001PU2_3140_3680",349.62498787790798,94.821131460340098,318832.14350840898,0.93669514526101605,0.359898834028401,0.330706681329833,null,"CB4MH","Middle Chesapeake Bay Mesohaline"]
["ANNE ARUNDEL02130903","ANNE ARUNDEL","02130903",22.775222137970339,2.448034485243157,5124.9108086733231,12.93371975193215,1.3074607282896671,1258.6880090577499,null,"N24001PU2_3180_3370",351.79767545671803,74.201014636509399,304587.29307261697,0.56393651387682797,0.27569365748785302,0.26345560430127701,null,"CB5MH_MD","Lower Chesapeake Bay Mesohaline Maryland"]
["ANNE ARUNDEL02130906","ANNE ARUNDEL","02130906",16.60407515320993,1.4622060607077541,5901.3931215057601,10.319498682676135,1.139267792980059,1545.731119604847,null,"N24001PU2_3370_4020",348.91315887140098,82.578438362069505,304671.78945193603,0.65758731130903503,0.32757262755150102,0.279328186355982,null,"CHOMH1","Choptank River Mesohaline mouth 1"]
{"$rows_left_out":494}
{"sheet":"P3 Curve Eqns","index":3,"n_rows":15,"n_cols":14,"rows_kept":15,"cut":false,"hidden":false,"merged":[[1,11,1,13],[3,0,6,0],[7,0,10,0],[11,0,14,0],[1,1,2,1],[1,10,2,10],[1,2,1,8]]}
[null,"Estimating Curve Equations for Stream Restoration Protocol 3"]
[null,"floodplain storage volume","rain depth (watershed inches)",null,null,null,null,null,null,null,"rain depth (watershed in)","regression equation"]
[null,null,0.1,0.25,0.5,1,1.5,2,2.5,null,null,"TN","TP","TSS"]
["TN",0.1,4,2.5,1.5,0.5,0.2,0,0,null,0.1,{"$f":"5.2193*LN('Protocol 3'!E5)+15.818","v":{"$error":"#NUM!"}},{"$f":"8.1187*LN('Protocol 3'!E5)+24.019","v":{"$error":"#NUM!"}},{"$f":"5.3163*LN('Protocol 3'!E5)+15.899","v":{"$error":"#NUM!"}}]
[null,0.25,8.3000000000000007,6,3.5,1,0.4,null,null,null,0.25,{"$f":"4.0174*LN('Protocol 3'!E5)+11.651","v":{"$error":"#NUM!"}},{"$f":"5.8206*LN('Protocol 3'!E5)+17.002","v":{"$error":"#NUM!"}},{"$f":"3.9597*LN('Protocol 3'!E5)+11.413","v":{"$error":"#NUM!"}}]
[null,0.5,12.1,8.6999999999999993,5,1.9,0.5,0.1,0,null,0.5,{"$f":"2.1712*LN('Protocol 3'!E5)+6.5035","v":{"$error":"#NUM!"}},{"$f":"3.4299*LN('Protocol 3'!E5)+10.008","v":{"$error":"#NUM!"}},{"$f":"2.1396*LN('Protocol 3'!E5)+6.6689","v":{"$error":"#NUM!"}}]
[null,1,16,11.8,6.5,2.1,0.6,0.2,0.1,null,1,{"$f":"0.7476*LN('Protocol 3'!E5)+2.194","v":{"$error":"#NUM!"}},{"$f":"1.3782*LN('Protocol 3'!E5)+4.1348","v":{"$error":"#NUM!"}},{"$f":"0.8546*LN('Protocol 3'!E5)+2.2612","v":{"$error":"#NUM!"}}]
["TP",0.1,5,4,2,1,1,1,1,null,1.5,{"$f":"0.1725*LN('Protocol 3'!E5)+0.6139","v":{"$error":"#NUM!"}},{"$f":"0.5159*LN('Protocol 3'!E5)+2.0651","v":{"$error":"#NUM!"}},{"$f":"0.4366*LN('Protocol 3'!E5)+0.8783","v":{"$error":"#NUM!"}}]
[null,0.25,13.5,8,5.5,2,1,null,null,null,2,{"$f":"0.0825*LN('Protocol 3'!E5)+0.1824","v":{"$error":"#NUM!"}},{"$f":"1","v":1},{"$f":"0.0825*LN('Protocol 3'!E5)+0.1824","v":{"$error":"#NUM!"}}]
[null,0.5,18,13.5,7.5,3.5,2,1,1,null,2.5,{"$f":"0.0358*LN('Protocol 3'!E5)+0.0691","v":{"$error":"#NUM!"}},{"$f":"1","v":1},{"$f":"0.0467*LN('Protocol 3'!E5)+0.1133","v":{"$error":"#NUM!"}}]
[null,1,24,17,10,4,2,1,1]
["TSS",0.1,3.8,2.2999999999999998,1.8,0.3,0,0,0]
[null,0.25,8.3000000000000007,6,3.7,1,0.1]
[null,0.5,12.2,8.5,5,1.8,0.5,0.1,0.1]
[null,1,16,11.5,6.8,2.2000000000000002,1,0.2,0.1]
{"$rows_left_out":1}
{"sheet":"Protocol 1","index":4,"n_rows":25,"n_cols":12,"rows_kept":25,"cut":false,"hidden":false,"merged":[[16,7,16,9],[17,7,17,9],[6,9,6,10],[5,9,5,10],[14,7,14,9],[15,7,15,9],[8,7,8,9],[4,0,4,1],[5,0,5,1],[7,0,7,5],[0,0,0,4],[13,7,13,12],[3,0,3,4],[3,7,3,12],[4,7,4,8],[4,9,4,10],[9,7,9,9],[6,7,6,8],[8,0,9,0],[4,11,6,12],[5,7,5,8],[10,7,10,9]]}
["Protocol 1: Credit for Prevented Sediment during Storm Flow"]
["Please populate the blue cells in this sheet with applicable project data. "]
["Step 1",null,null,null,null,null,null,"Step 2"]
["Estimate stream sediment erosion rates and annual sediment loadings.",null,null,null,null,null,null,"Convert stream bank erosion to nutrient loading."]
["# of Reaches",null,null,null,null,null,null,"Nutrient",null," lbs/ton sediment",null,"Because of the high variability, samples from the project reach should be collected and\nanalyzed for TN and TP concentrations."]
["Estimated Project Erosion Rate",null,{"$f":"SUM(E:E)","v":0},"tons/year",null,null,null,"Nitrogen"]
[null,null,null,null,null,null,null,"Phosphorus"]
["Note: Bank Erosion Rates are from Regional Curve"]
["Reach","Bulk Density of Soil","Bank Erosion Rate","Eroding Bank Area","Sediment Load",null,null,"Sediment",null,null,{"$f":"C6","v":0},"tons/year"]
[null,"C, lbs/ft3","R, ft/yr","A, ft2","S, tons/yr",null,null,"Total Nitrogen",null,null,{"$f":"C6*J6","v":0},"lbs/year"]
[1,null,null,null,{"$f":"(B11*C11*D11)/2000","v":0},null,null,"Total Phosphorus",null,null,{"$f":"C6*J7","v":0},"lbs/year"]
[{"$f":"A11+1","v":2},null,null,null,{"$f":"(B12*C12*D12)/2000","v":0}]
[{"$f":"A12+1","v":3},null,null,null,0,null,null,"Step 3"]
[4,null,null,null,0,null,null,"Estimate stream restoration efficiency - Justify efficiency with monitoring data or assume 50%"]
[5,null,null,null,0,null,null,"Efficiency",null,null,50,"%"]
{"$rows_left_out":11}
{"sheet":"Protocol 2","index":5,"n_rows":26,"n_cols":11,"rows_kept":26,"cut":false,"hidden":false,"merged":[[10,8,11,9],[10,10,11,11],[25,0,27,11],[15,1,15,2],[14,1,14,2],[13,1,13,2],[12,1,12,2],[11,1,11,2],[15,3,15,4],[14,3,14,4],[13,3,13,4],[12,3,12,4],[11,3,11,4],[10,5,10,6],[9,5,9,6],[15,5,15,6],[14,5,14,6],[13,5,13,6],[12,5,12,6],[11,5,11,6],[9,0,10,0],[9,1,9,2],[10,1,10,2],[9,3,9,4],[10,3,10,4],[4,3,4,4],[5,0,5,2],[5,3,5,4],[0,0,0,11],[22,0,22,2],[22,3,22,4],[20,0,20,2],[20,3,20,4],[19,0,19,11],[21,3,21,4],[21,0,21,2],[4,0,4,2]]}
["Protocol 2: Credit for Instream and Riparian Nutrient Processing within the Hyporheic Zone During Base Flow"]
["Please populate the blue cells in this sheet with applicable project data. "]
["Step 1"]
["Determine the total post construction stream length that has been reconnected using the bank height ratio of 1.0 or less."]
["Total Stream Length",null,null,null,null,"ft"]
["Connected on both sides?",null,null,"No",null,"at bank height ratio of 1.0 or less"]
[]
["Step 2"]
["Determine the dimensions of the hyporheic box. There may be several, smaller hyporheic boxes that can be averaged across the reach."]
["Hyporheic Box","Width of Channel*",null,"Cross Sectional Area",null,"Box Volume"]
[null,"ft",null,"ft2",null,"ft3",null,null,"Average Hyporheic Box Volume, ft3",null,{"$f":"IFERROR(AVERAGE(F12:G16),0)","v":0}]
[1,null,null,{"$f":"IF(B12<>0,(((IF($D$6=\"Yes\",2,1)*5)+(IF($D$6=\"Yes\",1,0.5)*B12))*5),\"\")","v":""},null,{"$f":"IFERROR(D12*$D$5,\"\")","v":""}]
[2,null,null,"",null,""]
[3,null,null,"",null,""]
[4,null,null,{"$f":"IF(B15<>0,(((IF($D$6=\"Yes\",2,1)*5)+(IF($D$6=\"Yes\",1,0.5)*B15))*5),\"\")","v":""},null,{"$f":"IFERROR(D15*$D$5,\"\")","v":""}]
{"$rows_left_out":12}
{"sheet":"Protocol 2 Revised","index":6,"n_rows":37,"n_cols":5,"rows_kept":37,"cut":false,"hidden":false,"merged":[[28,1,28,3],[19,0,19,1],[19,2,19,3],[14,0,14,4],[36,0,38,4],[21,1,21,3],[18,2,18,3],[17,2,17,3],[16,2,16,3],[0,0,0,4],[8,0,8,4],[18,0,18,1],[17,0,17,1],[16,0,16,1]]}
["Protocol 2: Credit for Instream and Riparian Nutrient Processing within the Hyporehic Zone During Base Flow Revised"]
["Please populate the blue cells in this sheet with applicable project data. "]
["Step 1"]
["Define the extent of the effective hyperheic zone (EHZ)."]
["Floodplain Area",null,"sq ft"]
["Channel Area",null,"sq ft"]
[]
["Step 2"]
["Apply the new denitrification rate to the EHZ."]
["Floodplain",{"$f":"B5*0.00269","v":0},"lbs NO3/yr"]
["Channel",{"$f":"B6*0.00269","v":0},"lbs NO3/yr"]
[]
[]
["Step 3"]
["Apply the site specific discount factors referencing the table below."]
{"$rows_left_out":23}
{"sheet":"Protocol 3","index":7,"n_rows":34,"n_cols":7,"rows_kept":34,"cut":false,"hidden":false,"merged":[[33,0,33,8],[0,0,0,12],[22,1,22,2],[25,1,25,2],[24,1,24,2],[23,1,23,2],[10,1,10,2],[13,1,13,2],[12,1,12,2],[11,1,11,2],[4,4,4,5],[9,0,9,12],[5,4,5,5],[31,1,31,2],[32,1,32,2],[28,0,28,12],[5,0,5,3],[4,0,4,3],[6,0,6,11],[29,1,29,2],[30,1,30,2],[14,0,14,7],[20,0,20,1],[19,0,19,1],[18,0,18,1],[20,2,20,3],[19,2,19,3],[18,2,18,3]]}
["Protocol 3: Credit for Floodplain Reconnection Volume"]
["Please populate the blue cells in this sheet with applicable project data. "]
["Step 1"]
["Estimate the floodplain connection volume in the available floodplain area."]
["Floodplain Connection Volume",null,null,null,null,null,"watershed inches"]
["Rainfall Depth Required to Access the Floodplain",null,null,null,null,null,"in"]
["Note: Credit only applies to the additional runoff volume diverted to the floodplain beyond what existed prior to restoration up to 1.0 ft."]
[]
["Step 2"]
["Estimate the nitrogen and phosphorus removal rate attributable to floodplain reconnection for the floodplain connection volume achieved"]
["Pollutant","Removal Rate, %"]
["TN",{"$f":"IFERROR(VLOOKUP($E$6,'P3 Curve Eqns'!$K$4:$N$10,2,0),0)","v":0}]
["TP",{"$f":"IFERROR(VLOOKUP($E$6,'P3 Curve Eqns'!$K$4:$N$10,3,0),0)","v":0}]
["TSS",{"$f":"IFERROR(VLOOKUP($E$6,'P3 Curve Eqns'!$K$4:$N$10,4,0),0)","v":0}]
["Note: Removal rates can be estimated using the curves in Figures 3-5 in the Expert Panel report"]
{"$rows_left_out":20}
{"sheet":"Protocol 3 Revised","index":8,"n_rows":53,"n_cols":7,"rows_kept":53,"cut":false,"hidden":false,"merged":[[35,0,35,12],[46,4,46,6],[50,4,50,6],[46,0,46,1],[47,0,47,1],[49,0,49,1],[48,0,48,1],[21,0,21,12],[9,0,9,12],[0,0,0,12],[44,0,45,10],[36,0,36,1],[26,0,26,2],[24,0,24,2],[25,0,25,2],[23,0,23,2],[27,0,27,2],[28,0,28,2],[29,0,29,2],[38,0,38,2],[38,4,38,6],[30,0,30,2],[32,0,32,2]]}
["Protocol 3: Credit for Floodplain Reconnection Volume Revised"]
["Please populate the blue cells in this sheet with applicable project data. "]
["Step 1"]
["Determine the treatment depth in the FTZ."]
["Avg Flow Velocity",null,"ft/s"]
["Treatment Depth",null,"ft"]
["Note: Treatment depth capped at 1ft in MD"]
[]
["Step 2"]
["Identify the channel flow, floodplain flow at the treatment depth in the FTZ, and the mean baseflow."]
["Channel Flow",null,"cfs"]
["Floodplain Flow",null,"cfs"]
["Mean Baseflow",null,"cfs"]
[]
[]
{"$rows_left_out":39}
{"sheet":"Protocol 4","index":9,"n_rows":25,"n_cols":6,"rows_kept":25,"cut":false,"hidden":false,"merged":[[13,0,13,12],[5,0,5,12],[2,0,3,12],[6,0,6,2],[6,3,6,4],[7,0,7,2],[7,3,7,4],[12,0,12,12],[8,3,8,4],[8,0,8,2],[22,1,22,2],[0,0,0,12],[20,0,20,12],[24,3,24,4],[23,3,23,4],[22,3,22,4],[21,3,21,4],[21,1,21,2],[24,1,24,2],[23,1,23,2],[9,0,9,2],[9,3,9,4],[14,1,14,2],[17,1,17,2],[16,1,16,2],[15,1,15,2]]}
["Protocol 4: Credit for Dry Channel RSC as an Upland Stormwater Retrofit"]
["Please populate the blue cells in this sheet with applicable project data. "]
["Note: Dry channel RSC systems are classified as an upland stormwater retrofit. Use the protocols developed by the Urban Stormwater Retorfit Expert Panel to derive the specific nutrient and sediment removal rates. "]
[]
["Step 1"]
["Determine the runoff volume treated. "]
["Retrofit Storage (RS) Volume",null,null,null,null,"acre-feet"]
["Impervious Area",null,null,null,null,"%"]
["Drainage Area",null,null,null,null,"acres"]
["Runoff Volume Treated",null,null,{"$f":"IFERROR((D7*12)/((D8/100)*D9),0)","v":0},null,"in"]
[]
["Step 2"]
["Use the retrofit removal adjustor curves in the Urban Stormwater Retrofit Expert Panel to determine pollutant removal rate. "]
["Note: Dry channel RSC systems are classified as RR practices. Determine pollutant removal rate using RR curve. "]
["Pollutant","Removal Rate"]
{"$rows_left_out":11}
{"sheet":"Protocol 5","index":10,"n_rows":58,"n_cols":13,"rows_kept":58,"cut":false,"hidden":false,"merged":[[56,0,56,1],[56,2,56,3],[57,0,58,5],[49,4,49,5],[48,4,48,5],[55,4,55,5],[56,4,56,5],[55,0,55,1],[55,2,55,3],[43,0,43,2],[43,3,43,5],[48,0,48,3],[49,0,49,3],[54,4,54,5],[50,0,50,3],[50,4,50,5],[54,0,54,1],[54,2,54,3],[34,0,34,5],[36,0,36,5],[37,3,38,5],[20,3,20,5],[24,0,24,2],[23,0,23,2],[24,3,24,5],[23,3,23,5],[35,3,35,5],[35,0,35,2],[33,0,33,2],[32,0,32,3],[31,0,31,3],[30,0,30,3],[29,0,29,3],[28,0,28,3],[39,3,39,5],[37,0,37,2],[4,4,4,5],[7,0,8,3],[12,0,12,3],[9,0,9,3],[17,3,17,5],[17,0,17,2],[10,0,10,3],[11,0,11,3],[18,0,18,2],[22,0,22,2],[33,3,33,5],[20,0,20,2],[19,0,19,2],[19,3,19,5],[0,0,0,12],[3,0,3,12],[7,4,7,6],[4,0,4,3],[7,7,8,7],[5,0,5,3],[5,4,5,5],[19,10,19,11],[18,7,18,9],[18,10,18,11],[15,7,16,12],[22,3,22,5],[18,3,18,5],[16,0,16,5],[21,0,21,5],[27,0,27,3],[26,0,26,3],[32,4,32,5],[31,4,31,5],[30,4,30,5],[29,4,29,5],[28,4,28,5],[27,4,27,5],[26,4,26,5]]}
["Protocol 5: Alternative Prevented Sediment for Outfalls"]
["Please populate the blue cells in this sheet with applicable project data. "]
["Step 1"]
["Define the existing channel conditions. Measurements must be collected from the existing headwater channel."]
["Length of Proposed Project Reach",null,null,null,null,null,"ft"]
["Representative Bulk Density Sample ",null,null,null,null,null,"lb/ft3"]
[]
["Measurement",null,null,null,"Cross-Section",null,null,"Average"]
[null,null,null,null,1,2,3]
["Channel Slope",null,null,null,null,null,null,{"$f":"IFERROR(AVERAGE(E10:G10),0)","v":0},"ft/ft"]
["Bank Height",null,null,null,null,null,null,{"$f":"IFERROR(AVERAGE(E11:G11),0)","v":0},"ft"]
["Bottom Width",null,null,null,null,null,null,0,"ft"]
["Top Width",null,null,null,null,null,null,0,"ft"]
[]
["Step 2"]
{"$rows_left_out":43}